MERCURY_OPTIONS=
gmake[3]: Entering directory '/home/mercury/testing/run/build/mercury-srcdist-rotd-2025-03-30/tests/hard_coded'
{ echo MCFLAGS += '--grade java    --options-file /home/mercury/testing/run/build/mercury-srcdist-rotd-2025-03-30/stage2/Mercury.options --mercury-linkage static -j2 --flags ../TESTS_FLAGS --flags ../WS_FLAGS --use-subdirs    '; echo MCFLAGS += ' '; echo CFLAGS += '    '; echo JAVACFLAGS += '-J"-Xmx1024m"   '; echo CSCFLAGS += '   '; echo C2INITARGS += '/home/mercury/testing/run/build/mercury-srcdist-rotd-2025-03-30/stage2/library/mer_std.init /home/mercury/testing/run/build/mercury-srcdist-rotd-2025-03-30/stage2/runtime/mer_rt.init    '; echo MLLIBS += '   '; echo MLOBJS += '  '; echo LDFLAGS += '  '; echo LD_LIBFLAGS += '  '; echo EXTRA_LIBRARIES += ''; echo EXTRA_LIB_DIRS += ''; echo LIBGRADES = 'hlc.gc  '; echo INSTALL_PREFIX = '/home/mercury/testing/run/install'; echo LINKAGE = 'shared'; echo MERCURY_LINKAGE = 'shared'; } | /home/mercury/testing/run/build/mercury-srcdist-rotd-2025-03-30/stage2/scripts/mmc --make --options-file - string_contains_char.depend
gmake[3]: Leaving directory '/home/mercury/testing/run/build/mercury-srcdist-rotd-2025-03-30/tests/hard_coded'
gmake[3]: Entering directory '/home/mercury/testing/run/build/mercury-srcdist-rotd-2025-03-30/tests/hard_coded'
{ echo MCFLAGS += '--grade java    --options-file /home/mercury/testing/run/build/mercury-srcdist-rotd-2025-03-30/stage2/Mercury.options --mercury-linkage static -j2 --flags ../TESTS_FLAGS --flags ../WS_FLAGS --use-subdirs    '; echo MCFLAGS += ' '; echo CFLAGS += '    '; echo JAVACFLAGS += '-J"-Xmx1024m"   '; echo CSCFLAGS += '   '; echo C2INITARGS += '/home/mercury/testing/run/build/mercury-srcdist-rotd-2025-03-30/stage2/library/mer_std.init /home/mercury/testing/run/build/mercury-srcdist-rotd-2025-03-30/stage2/runtime/mer_rt.init    '; echo MLLIBS += '   '; echo MLOBJS += '  '; echo LDFLAGS += '  '; echo LD_LIBFLAGS += '  '; echo EXTRA_LIBRARIES += ''; echo EXTRA_LIB_DIRS += ''; echo LIBGRADES = 'hlc.gc  '; echo INSTALL_PREFIX = '/home/mercury/testing/run/install'; echo LINKAGE = 'shared'; echo MERCURY_LINKAGE = 'shared'; } | /home/mercury/testing/run/build/mercury-srcdist-rotd-2025-03-30/stage2/scripts/mmc --make --options-file - string_contains_char
Making Mercury/int3s/string_contains_char.int3
Making Mercury/ints/string_contains_char.int
Making Mercury/javas/jmercury/string_contains_char.java
Making Java class files
Mercury/javas/jmercury/string_contains_char.java:15: error: package jmercury.runtime does not exist 
    jmercury.runtime.JavaInternal.progname = "string_contains_char";
                    ^
Mercury/javas/jmercury/string_contains_char.java:16: error: package jmercury.runtime does not exist 
    jmercury.runtime.JavaInternal.args = args;
                    ^
Mercury/javas/jmercury/string_contains_char.java:17: error: package jmercury.runtime does not exist 
    jmercury.runtime.JavaInternal.exit_status = 0;
                    ^
Mercury/javas/jmercury/string_contains_char.java:18: error: cannot find symbol 
    library.ML_std_library_init();
    ^
  symbol:   variable library
  location: class string_contains_char
Mercury/javas/jmercury/string_contains_char.java:19: error: cannot find symbol 
    benchmarking.ML_initialise();
    ^
  symbol:   variable benchmarking
  location: class string_contains_char
Mercury/javas/jmercury/string_contains_char.java:25: error: package jmercury.runtime does not exist 
    jmercury.runtime.JavaInternal.runMain(run_main);
                    ^
Mercury/javas/jmercury/string_contains_char.java:26: error: cannot find symbol 
    io.flush_output_3_p_0(io.stdout_stream_0_f_0());
                          ^
  symbol:   variable io
  location: class string_contains_char
Mercury/javas/jmercury/string_contains_char.java:26: error: cannot find symbol 
    io.flush_output_3_p_0(io.stdout_stream_0_f_0());
    ^
  symbol:   variable io
  location: class string_contains_char
Mercury/javas/jmercury/string_contains_char.java:27: error: cannot find symbol 
    io.flush_output_3_p_0(io.stderr_stream_0_f_0());
                          ^
  symbol:   variable io
  location: class string_contains_char
Mercury/javas/jmercury/string_contains_char.java:27: error: cannot find symbol 
    io.flush_output_3_p_0(io.stderr_stream_0_f_0());
    ^
  symbol:   variable io
  location: class string_contains_char
Mercury/javas/jmercury/string_contains_char.java:28: error: package jmercury.runtime does not exist 
    java.lang.System.exit(jmercury.runtime.JavaInternal.exit_status);
                                          ^
Mercury/javas/jmercury/string_contains_char.java:122: error: cannot find symbol 
      Ilseq_4 = string.between_3_f_0(Var_38, Var_39, Var_40);
                ^
  symbol:   variable string
  location: class string_contains_char
Mercury/javas/jmercury/string_contains_char.java:127: error: cannot find symbol 
      Var_42 = string.f_43_43_2_f_0(Ilseq_4, Var_43);
               ^
  symbol:   variable string
  location: class string_contains_char
Mercury/javas/jmercury/string_contains_char.java:130: error: cannot find symbol 
      S_5 = string.f_43_43_2_f_0(Var_41, Var_42);
            ^
  symbol:   variable string
  location: class string_contains_char
Mercury/javas/jmercury/string_contains_char.java:160: error: package jmercury.runtime does not exist 
    jmercury.runtime.TypeInfo_Struct TypeCtorInfo_22_22 = null;
                    ^
Mercury/javas/jmercury/string_contains_char.java:161: error: package jmercury.runtime does not exist 
    jmercury.runtime.TypeInfo_Struct TypeCtorInfo_23_23 = null;
                    ^
Mercury/javas/jmercury/string_contains_char.java:171: error: cannot find symbol 
      succeeded = string.contains_char_2_p_0(String_5, Char_6);
                  ^
  symbol:   variable string
  location: class string_contains_char
Mercury/javas/jmercury/string_contains_char.java:177: error: cannot find symbol 
    TypeCtorInfo_22_22 = jmercury.runtime.TypeInfo_Struct.maybe_new(builtin.builtin__type_ctor_info_string_0);
                                                                    ^
  symbol:   variable builtin
  location: class string_contains_char
Mercury/javas/jmercury/string_contains_char.java:177: error: package jmercury.runtime does not exist 
    TypeCtorInfo_22_22 = jmercury.runtime.TypeInfo_Struct.maybe_new(builtin.builtin__type_ctor_info_string_0);
                                         ^
Mercury/javas/jmercury/string_contains_char.java:179: error: cannot find symbol 
      Var_15 = string.string_1_f_0(TypeCtorInfo_22_22, ((java.lang.Object) (String_5)));
               ^
  symbol:   variable string
  location: class string_contains_char
Mercury/javas/jmercury/string_contains_char.java:181: error: cannot find symbol 
    TypeCtorInfo_23_23 = jmercury.runtime.TypeInfo_Struct.maybe_new(builtin.builtin__type_ctor_info_character_0);
                                                                    ^
  symbol:   variable builtin
  location: class string_contains_char
Mercury/javas/jmercury/string_contains_char.java:181: error: package jmercury.runtime does not exist 
    TypeCtorInfo_23_23 = jmercury.runtime.TypeInfo_Struct.maybe_new(builtin.builtin__type_ctor_info_character_0);
                                         ^
Mercury/javas/jmercury/string_contains_char.java:183: error: cannot find symbol 
      Var_18 = string.string_1_f_0(TypeCtorInfo_23_23, java.lang.Integer.valueOf(Char_6));
               ^
  symbol:   variable string
  location: class string_contains_char
Mercury/javas/jmercury/string_contains_char.java:187: error: cannot find symbol 
      io.write_string_3_p_0(Var_25);
      ^
  symbol:   variable io
  location: class string_contains_char
Mercury/javas/jmercury/string_contains_char.java:190: error: cannot find symbol 
      io.write_string_3_p_0(Var_15);
      ^
  symbol:   variable io
  location: class string_contains_char
Mercury/javas/jmercury/string_contains_char.java:194: error: cannot find symbol 
      io.write_string_3_p_0(Var_28);
      ^
  symbol:   variable io
  location: class string_contains_char
Mercury/javas/jmercury/string_contains_char.java:197: error: cannot find symbol 
      io.write_string_3_p_0(Var_18);
      ^
  symbol:   variable io
  location: class string_contains_char
Mercury/javas/jmercury/string_contains_char.java:201: error: cannot find symbol 
      io.write_string_3_p_0(Var_31);
      ^
  symbol:   variable io
  location: class string_contains_char
Mercury/javas/jmercury/string_contains_char.java:204: error: cannot find symbol 
      io.write_string_3_p_0(Result_8);
      ^
  symbol:   variable io
  location: class string_contains_char
Mercury/javas/jmercury/string_contains_char.java:208: error: cannot find symbol 
      io.write_string_3_p_0(Var_33);
      ^
  symbol:   variable io
  location: class string_contains_char
30 errors
gmake[3]: *** [/tmp/mmake.dfmdXK:2362: string_contains_char] Error 1
gmake[3]: Target 'string_contains_char.runtest' not remade because of errors.
gmake[3]: Leaving directory '/home/mercury/testing/run/build/mercury-srcdist-rotd-2025-03-30/tests/hard_coded'