MERCURY_OPTIONS=
gmake[3]: Entering directory '/home/mercury/testing/run/build/mercury-srcdist-rotd-2025-03-30/tests/hard_coded'
{ echo MCFLAGS += '--grade java    --options-file /home/mercury/testing/run/build/mercury-srcdist-rotd-2025-03-30/stage2/Mercury.options --mercury-linkage static -j2 --flags ../TESTS_FLAGS --flags ../WS_FLAGS --use-subdirs    '; echo MCFLAGS += ' '; echo CFLAGS += '    '; echo JAVACFLAGS += '-J"-Xmx1024m"   '; echo CSCFLAGS += '   '; echo C2INITARGS += '/home/mercury/testing/run/build/mercury-srcdist-rotd-2025-03-30/stage2/library/mer_std.init /home/mercury/testing/run/build/mercury-srcdist-rotd-2025-03-30/stage2/runtime/mer_rt.init    '; echo MLLIBS += '   '; echo MLOBJS += '  '; echo LDFLAGS += '  '; echo LD_LIBFLAGS += '  '; echo EXTRA_LIBRARIES += ''; echo EXTRA_LIB_DIRS += ''; echo LIBGRADES = 'hlc.gc  '; echo INSTALL_PREFIX = '/home/mercury/testing/run/install'; echo LINKAGE = 'shared'; echo MERCURY_LINKAGE = 'shared'; } | /home/mercury/testing/run/build/mercury-srcdist-rotd-2025-03-30/stage2/scripts/mmc --make --options-file - pack_int32.depend
gmake[3]: Leaving directory '/home/mercury/testing/run/build/mercury-srcdist-rotd-2025-03-30/tests/hard_coded'
gmake[3]: Entering directory '/home/mercury/testing/run/build/mercury-srcdist-rotd-2025-03-30/tests/hard_coded'
{ echo MCFLAGS += '--grade java    --options-file /home/mercury/testing/run/build/mercury-srcdist-rotd-2025-03-30/stage2/Mercury.options --mercury-linkage static -j2 --flags ../TESTS_FLAGS --flags ../WS_FLAGS --use-subdirs    '; echo MCFLAGS += ' '; echo CFLAGS += '    '; echo JAVACFLAGS += '-J"-Xmx1024m"   '; echo CSCFLAGS += '   '; echo C2INITARGS += '/home/mercury/testing/run/build/mercury-srcdist-rotd-2025-03-30/stage2/library/mer_std.init /home/mercury/testing/run/build/mercury-srcdist-rotd-2025-03-30/stage2/runtime/mer_rt.init    '; echo MLLIBS += '   '; echo MLOBJS += '  '; echo LDFLAGS += '  '; echo LD_LIBFLAGS += '  '; echo EXTRA_LIBRARIES += ''; echo EXTRA_LIB_DIRS += ''; echo LIBGRADES = 'hlc.gc  '; echo INSTALL_PREFIX = '/home/mercury/testing/run/install'; echo LINKAGE = 'shared'; echo MERCURY_LINKAGE = 'shared'; } | /home/mercury/testing/run/build/mercury-srcdist-rotd-2025-03-30/stage2/scripts/mmc --make --options-file - pack_int32
Making Mercury/int3s/pack_int32.int3
Making Mercury/ints/pack_int32.int
Making Mercury/javas/jmercury/pack_int32.java
Making Java class files
Mercury/javas/jmercury/pack_int32.java:32: error: package jmercury.runtime does not exist 
  private static final jmercury.runtime.PseudoTypeInfo[] pack_int32__field_types_struct_0_0 = new jmercury.runtime.PseudoTypeInfo[4];
                                       ^
Mercury/javas/jmercury/pack_int32.java:33: error: package jmercury.runtime does not exist 
  private static final jmercury.runtime.DuFunctorDesc pack_int32__du_functor_desc_struct_0_0 = new jmercury.runtime.DuFunctorDesc();
                                       ^
Mercury/javas/jmercury/pack_int32.java:34: error: package jmercury.runtime does not exist 
  private static final jmercury.runtime.DuFunctorDesc[] pack_int32__du_stag_ordered_struct_0_0 = new jmercury.runtime.DuFunctorDesc[1];
                                       ^
Mercury/javas/jmercury/pack_int32.java:35: error: package jmercury.runtime does not exist 
  private static final jmercury.runtime.DuPtagLayout[] pack_int32__du_ptag_ordered_struct_0 = new jmercury.runtime.DuPtagLayout[1];
                                       ^
Mercury/javas/jmercury/pack_int32.java:36: error: package jmercury.runtime does not exist 
  private static final jmercury.runtime.DuFunctorDesc[] pack_int32__du_name_ordered_struct_0 = new jmercury.runtime.DuFunctorDesc[1];
                                       ^
Mercury/javas/jmercury/pack_int32.java:38: error: package jmercury.runtime does not exist 
  public static final jmercury.runtime.TypeCtorInfo_Struct pack_int32__type_ctor_info_struct_0 = new jmercury.runtime.TypeCtorInfo_Struct();
                                      ^
Mercury/javas/jmercury/pack_int32.java:471: error: package jmercury.runtime does not exist 
    implements jmercury.runtime.MercuryType
                               ^
Mercury/javas/jmercury/pack_int32.java:266: error: package builtin does not exist 
  private static builtin.Comparison_result_0
                        ^
Mercury/javas/jmercury/pack_int32.java:429: error: package jmercury.runtime does not exist 
    implements jmercury.runtime.MethodPtr2
                               ^
Mercury/javas/jmercury/pack_int32.java:15: error: package jmercury.runtime does not exist 
    jmercury.runtime.JavaInternal.progname = "pack_int32";
                    ^
Mercury/javas/jmercury/pack_int32.java:16: error: package jmercury.runtime does not exist 
    jmercury.runtime.JavaInternal.args = args;
                    ^
Mercury/javas/jmercury/pack_int32.java:17: error: package jmercury.runtime does not exist 
    jmercury.runtime.JavaInternal.exit_status = 0;
                    ^
Mercury/javas/jmercury/pack_int32.java:18: error: cannot find symbol 
    library.ML_std_library_init();
    ^
  symbol:   variable library
  location: class pack_int32
Mercury/javas/jmercury/pack_int32.java:19: error: cannot find symbol 
    benchmarking.ML_initialise();
    ^
  symbol:   variable benchmarking
  location: class pack_int32
Mercury/javas/jmercury/pack_int32.java:25: error: package jmercury.runtime does not exist 
    jmercury.runtime.JavaInternal.runMain(run_main);
                    ^
Mercury/javas/jmercury/pack_int32.java:26: error: cannot find symbol 
    io.flush_output_3_p_0(io.stdout_stream_0_f_0());
                          ^
  symbol:   variable io
  location: class pack_int32
Mercury/javas/jmercury/pack_int32.java:26: error: cannot find symbol 
    io.flush_output_3_p_0(io.stdout_stream_0_f_0());
    ^
  symbol:   variable io
  location: class pack_int32
Mercury/javas/jmercury/pack_int32.java:27: error: cannot find symbol 
    io.flush_output_3_p_0(io.stderr_stream_0_f_0());
                          ^
  symbol:   variable io
  location: class pack_int32
Mercury/javas/jmercury/pack_int32.java:27: error: cannot find symbol 
    io.flush_output_3_p_0(io.stderr_stream_0_f_0());
    ^
  symbol:   variable io
  location: class pack_int32
Mercury/javas/jmercury/pack_int32.java:28: error: package jmercury.runtime does not exist 
    java.lang.System.exit(jmercury.runtime.JavaInternal.exit_status);
                                          ^
Mercury/javas/jmercury/pack_int32.java:32: error: package jmercury.runtime does not exist 
  private static final jmercury.runtime.PseudoTypeInfo[] pack_int32__field_types_struct_0_0 = new jmercury.runtime.PseudoTypeInfo[4];
                                                                                                                  ^
Mercury/javas/jmercury/pack_int32.java:33: error: package jmercury.runtime does not exist 
  private static final jmercury.runtime.DuFunctorDesc pack_int32__du_functor_desc_struct_0_0 = new jmercury.runtime.DuFunctorDesc();
                                                                                                                   ^
Mercury/javas/jmercury/pack_int32.java:34: error: package jmercury.runtime does not exist 
  private static final jmercury.runtime.DuFunctorDesc[] pack_int32__du_stag_ordered_struct_0_0 = new jmercury.runtime.DuFunctorDesc[1];
                                                                                                                     ^
Mercury/javas/jmercury/pack_int32.java:35: error: package jmercury.runtime does not exist 
  private static final jmercury.runtime.DuPtagLayout[] pack_int32__du_ptag_ordered_struct_0 = new jmercury.runtime.DuPtagLayout[1];
                                                                                                                  ^
Mercury/javas/jmercury/pack_int32.java:36: error: package jmercury.runtime does not exist 
  private static final jmercury.runtime.DuFunctorDesc[] pack_int32__du_name_ordered_struct_0 = new jmercury.runtime.DuFunctorDesc[1];
                                                                                                                   ^
Mercury/javas/jmercury/pack_int32.java:38: error: package jmercury.runtime does not exist 
  public static final jmercury.runtime.TypeCtorInfo_Struct pack_int32__type_ctor_info_struct_0 = new jmercury.runtime.TypeCtorInfo_Struct();
                                                                                                                     ^
Mercury/javas/jmercury/pack_int32.java:43: error: package jmercury.runtime does not exist 
      (jmercury.runtime.PseudoTypeInfo) builtin.builtin__type_ctor_info_int32_0;
                       ^
Mercury/javas/jmercury/pack_int32.java:43: error: cannot find symbol 
      (jmercury.runtime.PseudoTypeInfo) builtin.builtin__type_ctor_info_int32_0;
                                        ^
  symbol:   variable builtin
  location: class pack_int32
Mercury/javas/jmercury/pack_int32.java:45: error: package jmercury.runtime does not exist 
      (jmercury.runtime.PseudoTypeInfo) builtin.builtin__type_ctor_info_int32_0;
                       ^
Mercury/javas/jmercury/pack_int32.java:45: error: cannot find symbol 
      (jmercury.runtime.PseudoTypeInfo) builtin.builtin__type_ctor_info_int32_0;
                                        ^
  symbol:   variable builtin
  location: class pack_int32
Mercury/javas/jmercury/pack_int32.java:47: error: package jmercury.runtime does not exist 
      (jmercury.runtime.PseudoTypeInfo) builtin.builtin__type_ctor_info_int32_0;
                       ^
Mercury/javas/jmercury/pack_int32.java:47: error: cannot find symbol 
      (jmercury.runtime.PseudoTypeInfo) builtin.builtin__type_ctor_info_int32_0;
                                        ^
  symbol:   variable builtin
  location: class pack_int32
Mercury/javas/jmercury/pack_int32.java:49: error: package jmercury.runtime does not exist 
      (jmercury.runtime.PseudoTypeInfo) builtin.builtin__type_ctor_info_int32_0;
                       ^
Mercury/javas/jmercury/pack_int32.java:49: error: cannot find symbol 
      (jmercury.runtime.PseudoTypeInfo) builtin.builtin__type_ctor_info_int32_0;
                                        ^
  symbol:   variable builtin
  location: class pack_int32
Mercury/javas/jmercury/pack_int32.java:54: error: cannot find symbol 
      private_builtin.MR_SECTAG_NONE,
      ^
  symbol:   variable private_builtin
  location: class pack_int32
Mercury/javas/jmercury/pack_int32.java:62: error: cannot find symbol 
      private_builtin.MR_FUNCTOR_SUBTYPE_NONE,
      ^
  symbol:   variable private_builtin
  location: class pack_int32
Mercury/javas/jmercury/pack_int32.java:68: error: package jmercury.runtime does not exist 
      new jmercury.runtime.DuPtagLayout(
                          ^
Mercury/javas/jmercury/pack_int32.java:70: error: cannot find symbol 
        private_builtin.MR_SECTAG_NONE,
        ^
  symbol:   variable private_builtin
  location: class pack_int32
Mercury/javas/jmercury/pack_int32.java:84: error: package jmercury.runtime does not exist 
      jmercury.runtime.TypeCtorRep.MR_TYPECTOR_REP_DU,
                      ^
Mercury/javas/jmercury/pack_int32.java:89: error: package jmercury.runtime does not exist 
      new jmercury.runtime.TypeFunctors(
                          ^
Mercury/javas/jmercury/pack_int32.java:92: error: package jmercury.runtime does not exist 
      new jmercury.runtime.TypeLayout(
                          ^
Mercury/javas/jmercury/pack_int32.java:225: error: cannot find symbol 
      io.write_string_3_p_0(Var_11);
      ^
  symbol:   variable io
  location: class pack_int32
Mercury/javas/jmercury/pack_int32.java:228: error: cannot find symbol 
      io.write_int32_3_p_0(A_4);
      ^
  symbol:   variable io
  location: class pack_int32
Mercury/javas/jmercury/pack_int32.java:232: error: cannot find symbol 
      io.write_string_3_p_0(Var_14);
      ^
  symbol:   variable io
  location: class pack_int32
Mercury/javas/jmercury/pack_int32.java:235: error: cannot find symbol 
      io.write_int32_3_p_0(B_5);
      ^
  symbol:   variable io
  location: class pack_int32
Mercury/javas/jmercury/pack_int32.java:239: error: cannot find symbol 
      io.write_string_3_p_0(Var_17);
      ^
  symbol:   variable io
  location: class pack_int32
Mercury/javas/jmercury/pack_int32.java:242: error: cannot find symbol 
      io.write_int32_3_p_0(C_6);
      ^
  symbol:   variable io
  location: class pack_int32
Mercury/javas/jmercury/pack_int32.java:246: error: cannot find symbol 
      io.write_string_3_p_0(Var_20);
      ^
  symbol:   variable io
  location: class pack_int32
Mercury/javas/jmercury/pack_int32.java:249: error: cannot find symbol 
      io.write_int32_3_p_0(D_7);
      ^
  symbol:   variable io
  location: class pack_int32
Mercury/javas/jmercury/pack_int32.java:253: error: cannot find symbol 
      io.write_string_3_p_0(Var_23);
      ^
  symbol:   variable io
  location: class pack_int32
Mercury/javas/jmercury/pack_int32.java:272: error: package builtin does not exist 
    builtin.Comparison_result_0 HeadVar__1_1 = null;
           ^
Mercury/javas/jmercury/pack_int32.java:278: error: package builtin does not exist 
      HeadVar__1_1 = builtin.Comparison_result_0.K0;
                            ^
Mercury/javas/jmercury/pack_int32.java:289: error: package builtin does not exist 
      builtin.Comparison_result_0 SubResult1_6 = null;
             ^
Mercury/javas/jmercury/pack_int32.java:293: error: package builtin does not exist 
        SubResult1_6 = builtin.Comparison_result_0.K1;
                              ^
Mercury/javas/jmercury/pack_int32.java:298: error: package builtin does not exist 
          SubResult1_6 = builtin.Comparison_result_0.K2;
                                ^
Mercury/javas/jmercury/pack_int32.java:300: error: package builtin does not exist 
          SubResult1_6 = builtin.Comparison_result_0.K0;
                                ^
Mercury/javas/jmercury/pack_int32.java:302: error: package builtin.Comparison_result_0 does not exist 
      succeeded = (SubResult1_6.MR_value != builtin.Comparison_result_0.K0.MR_value);
                                                                       ^
Mercury/javas/jmercury/pack_int32.java:307: error: package builtin does not exist 
        builtin.Comparison_result_0 SubResult2_9 = null;
               ^
Mercury/javas/jmercury/pack_int32.java:311: error: package builtin does not exist 
          SubResult2_9 = builtin.Comparison_result_0.K1;
                                ^
Mercury/javas/jmercury/pack_int32.java:316: error: package builtin does not exist 
            SubResult2_9 = builtin.Comparison_result_0.K2;
                                  ^
Mercury/javas/jmercury/pack_int32.java:318: error: package builtin does not exist 
            SubResult2_9 = builtin.Comparison_result_0.K0;
                                  ^
Mercury/javas/jmercury/pack_int32.java:320: error: package builtin.Comparison_result_0 does not exist 
        succeeded = (SubResult2_9.MR_value != builtin.Comparison_result_0.K0.MR_value);
                                                                         ^
Mercury/javas/jmercury/pack_int32.java:325: error: package builtin does not exist 
          builtin.Comparison_result_0 SubResult3_12 = null;
                 ^
Mercury/javas/jmercury/pack_int32.java:329: error: package builtin does not exist 
            SubResult3_12 = builtin.Comparison_result_0.K1;
                                   ^
Mercury/javas/jmercury/pack_int32.java:334: error: package builtin does not exist 
              SubResult3_12 = builtin.Comparison_result_0.K2;
                                     ^
Mercury/javas/jmercury/pack_int32.java:336: error: package builtin does not exist 
              SubResult3_12 = builtin.Comparison_result_0.K0;
                                     ^
Mercury/javas/jmercury/pack_int32.java:338: error: package builtin.Comparison_result_0 does not exist 
          succeeded = (SubResult3_12.MR_value != builtin.Comparison_result_0.K0.MR_value);
                                                                            ^
Mercury/javas/jmercury/pack_int32.java:345: error: package builtin does not exist 
              HeadVar__1_1 = builtin.Comparison_result_0.K1;
                                    ^
Mercury/javas/jmercury/pack_int32.java:350: error: package builtin does not exist 
                HeadVar__1_1 = builtin.Comparison_result_0.K2;
                                      ^
Mercury/javas/jmercury/pack_int32.java:352: error: package builtin does not exist 
                HeadVar__1_1 = builtin.Comparison_result_0.K0;
                                      ^
Mercury/javas/jmercury/pack_int32.java:367: error: package builtin does not exist 
    builtin.Comparison_result_0 conv0_HeadVar__1_1 = null;
           ^
Mercury/javas/jmercury/pack_int32.java:458: error: package jmercury.runtime does not exist 
          throw new jmercury.runtime.UnreachableDefault();
                                    ^
72 errors
gmake[3]: *** [/tmp/mmake.H8MgOk:2362: pack_int32] Error 1
gmake[3]: Target 'pack_int32.runtest' not remade because of errors.
gmake[3]: Leaving directory '/home/mercury/testing/run/build/mercury-srcdist-rotd-2025-03-30/tests/hard_coded'