MERCURY_OPTIONS=
gmake[3]: Entering directory '/home/mercury/testing/run/build/mercury-srcdist-rotd-2025-03-30/tests/hard_coded'
{ echo MCFLAGS += '--grade java    --options-file /home/mercury/testing/run/build/mercury-srcdist-rotd-2025-03-30/stage2/Mercury.options --mercury-linkage static -j2 --flags ../TESTS_FLAGS --flags ../WS_FLAGS --use-subdirs  --optimize-format-calls  '; echo MCFLAGS += ' '; echo CFLAGS += '    '; echo JAVACFLAGS += '-J"-Xmx1024m"   '; echo CSCFLAGS += '   '; echo C2INITARGS += '/home/mercury/testing/run/build/mercury-srcdist-rotd-2025-03-30/stage2/library/mer_std.init /home/mercury/testing/run/build/mercury-srcdist-rotd-2025-03-30/stage2/runtime/mer_rt.init    '; echo MLLIBS += '   '; echo MLOBJS += '  '; echo LDFLAGS += '  '; echo LD_LIBFLAGS += '  '; echo EXTRA_LIBRARIES += ''; echo EXTRA_LIB_DIRS += ''; echo LIBGRADES = 'hlc.gc  '; echo INSTALL_PREFIX = '/home/mercury/testing/run/install'; echo LINKAGE = 'shared'; echo MERCURY_LINKAGE = 'shared'; } | /home/mercury/testing/run/build/mercury-srcdist-rotd-2025-03-30/stage2/scripts/mmc --make --options-file - opt_format_sign_extend.depend
gmake[3]: Leaving directory '/home/mercury/testing/run/build/mercury-srcdist-rotd-2025-03-30/tests/hard_coded'
gmake[3]: Entering directory '/home/mercury/testing/run/build/mercury-srcdist-rotd-2025-03-30/tests/hard_coded'
{ echo MCFLAGS += '--grade java    --options-file /home/mercury/testing/run/build/mercury-srcdist-rotd-2025-03-30/stage2/Mercury.options --mercury-linkage static -j2 --flags ../TESTS_FLAGS --flags ../WS_FLAGS --use-subdirs  --optimize-format-calls  '; echo MCFLAGS += ' '; echo CFLAGS += '    '; echo JAVACFLAGS += '-J"-Xmx1024m"   '; echo CSCFLAGS += '   '; echo C2INITARGS += '/home/mercury/testing/run/build/mercury-srcdist-rotd-2025-03-30/stage2/library/mer_std.init /home/mercury/testing/run/build/mercury-srcdist-rotd-2025-03-30/stage2/runtime/mer_rt.init    '; echo MLLIBS += '   '; echo MLOBJS += '  '; echo LDFLAGS += '  '; echo LD_LIBFLAGS += '  '; echo EXTRA_LIBRARIES += ''; echo EXTRA_LIB_DIRS += ''; echo LIBGRADES = 'hlc.gc  '; echo INSTALL_PREFIX = '/home/mercury/testing/run/install'; echo LINKAGE = 'shared'; echo MERCURY_LINKAGE = 'shared'; } | /home/mercury/testing/run/build/mercury-srcdist-rotd-2025-03-30/stage2/scripts/mmc --make --options-file - opt_format_sign_extend
Making Mercury/int3s/opt_format_sign_extend.int3
Making Mercury/ints/opt_format_sign_extend.int
Making Mercury/javas/jmercury/opt_format_sign_extend.java
Making Java class files
Mercury/javas/jmercury/opt_format_sign_extend.java:32: error: package string__parse_util does not exist 
  private static final string__parse_util.String_format_flags_0[] MR_scalar_common_1 = new string__parse_util.String_format_flags_0[1];
                                         ^
Mercury/javas/jmercury/opt_format_sign_extend.java:15: error: package jmercury.runtime does not exist 
    jmercury.runtime.JavaInternal.progname = "opt_format_sign_extend";
                    ^
Mercury/javas/jmercury/opt_format_sign_extend.java:16: error: package jmercury.runtime does not exist 
    jmercury.runtime.JavaInternal.args = args;
                    ^
Mercury/javas/jmercury/opt_format_sign_extend.java:17: error: package jmercury.runtime does not exist 
    jmercury.runtime.JavaInternal.exit_status = 0;
                    ^
Mercury/javas/jmercury/opt_format_sign_extend.java:18: error: cannot find symbol 
    library.ML_std_library_init();
    ^
  symbol:   variable library
  location: class opt_format_sign_extend
Mercury/javas/jmercury/opt_format_sign_extend.java:19: error: cannot find symbol 
    benchmarking.ML_initialise();
    ^
  symbol:   variable benchmarking
  location: class opt_format_sign_extend
Mercury/javas/jmercury/opt_format_sign_extend.java:25: error: package jmercury.runtime does not exist 
    jmercury.runtime.JavaInternal.runMain(run_main);
                    ^
Mercury/javas/jmercury/opt_format_sign_extend.java:26: error: cannot find symbol 
    io.flush_output_3_p_0(io.stdout_stream_0_f_0());
                          ^
  symbol:   variable io
  location: class opt_format_sign_extend
Mercury/javas/jmercury/opt_format_sign_extend.java:26: error: cannot find symbol 
    io.flush_output_3_p_0(io.stdout_stream_0_f_0());
    ^
  symbol:   variable io
  location: class opt_format_sign_extend
Mercury/javas/jmercury/opt_format_sign_extend.java:27: error: cannot find symbol 
    io.flush_output_3_p_0(io.stderr_stream_0_f_0());
                          ^
  symbol:   variable io
  location: class opt_format_sign_extend
Mercury/javas/jmercury/opt_format_sign_extend.java:27: error: cannot find symbol 
    io.flush_output_3_p_0(io.stderr_stream_0_f_0());
    ^
  symbol:   variable io
  location: class opt_format_sign_extend
Mercury/javas/jmercury/opt_format_sign_extend.java:28: error: package jmercury.runtime does not exist 
    java.lang.System.exit(jmercury.runtime.JavaInternal.exit_status);
                                          ^
Mercury/javas/jmercury/opt_format_sign_extend.java:32: error: package string__parse_util does not exist 
  private static final string__parse_util.String_format_flags_0[] MR_scalar_common_1 = new string__parse_util.String_format_flags_0[1];
                                                                                                             ^
Mercury/javas/jmercury/opt_format_sign_extend.java:36: error: package string__parse_util does not exist 
      new string__parse_util.String_format_flags_0(
                            ^
Mercury/javas/jmercury/opt_format_sign_extend.java:37: error: package string__parse_util does not exist 
        string__parse_util.String_format_flag_hash_0.K0,
                          ^
Mercury/javas/jmercury/opt_format_sign_extend.java:38: error: package string__parse_util does not exist 
        string__parse_util.String_format_flag_space_0.K0,
                          ^
Mercury/javas/jmercury/opt_format_sign_extend.java:39: error: package string__parse_util does not exist 
        string__parse_util.String_format_flag_zero_0.K0,
                          ^
Mercury/javas/jmercury/opt_format_sign_extend.java:40: error: package string__parse_util does not exist 
        string__parse_util.String_format_flag_minus_0.K0,
                          ^
Mercury/javas/jmercury/opt_format_sign_extend.java:41: error: package string__parse_util does not exist 
        string__parse_util.String_format_flag_plus_0.K0
                          ^
Mercury/javas/jmercury/opt_format_sign_extend.java:78: error: package string__parse_util does not exist 
    string__parse_util.String_format_int_base_0 Var_154 = null;
                      ^
Mercury/javas/jmercury/opt_format_sign_extend.java:81: error: package string__parse_util does not exist 
    string__parse_util.String_format_flags_0 Var_162 = null;
                      ^
Mercury/javas/jmercury/opt_format_sign_extend.java:83: error: package string__parse_util does not exist 
    string__parse_util.String_format_int_base_0 Var_165 = null;
                      ^
Mercury/javas/jmercury/opt_format_sign_extend.java:87: error: package string__parse_util does not exist 
    string__parse_util.String_format_int_base_0 Var_176 = null;
                      ^
Mercury/javas/jmercury/opt_format_sign_extend.java:91: error: package string__parse_util does not exist 
    string__parse_util.String_format_int_base_0 Var_187 = null;
                      ^
Mercury/javas/jmercury/opt_format_sign_extend.java:95: error: package string__parse_util does not exist 
    string__parse_util.String_format_int_base_0 Var_198 = null;
                      ^
Mercury/javas/jmercury/opt_format_sign_extend.java:99: error: package string__parse_util does not exist 
    string__parse_util.String_format_int_base_0 Var_209 = null;
                      ^
Mercury/javas/jmercury/opt_format_sign_extend.java:103: error: package string__parse_util does not exist 
    string__parse_util.String_format_int_base_0 Var_220 = null;
                      ^
Mercury/javas/jmercury/opt_format_sign_extend.java:107: error: package string__parse_util does not exist 
    string__parse_util.String_format_int_base_0 Var_231 = null;
                      ^
Mercury/javas/jmercury/opt_format_sign_extend.java:111: error: package string__parse_util does not exist 
    string__parse_util.String_format_int_base_0 Var_242 = null;
                      ^
Mercury/javas/jmercury/opt_format_sign_extend.java:115: error: package string__parse_util does not exist 
    string__parse_util.String_format_int_base_0 Var_253 = null;
                      ^
Mercury/javas/jmercury/opt_format_sign_extend.java:119: error: package string__parse_util does not exist 
    string__parse_util.String_format_int_base_0 Var_264 = null;
                      ^
Mercury/javas/jmercury/opt_format_sign_extend.java:123: error: package string__parse_util does not exist 
    string__parse_util.String_format_int_base_0 Var_275 = null;
                      ^
Mercury/javas/jmercury/opt_format_sign_extend.java:127: error: package string__parse_util does not exist 
    string__parse_util.String_format_int_base_0 Var_286 = null;
                      ^
Mercury/javas/jmercury/opt_format_sign_extend.java:131: error: package string__parse_util does not exist 
    string__parse_util.String_format_int_base_0 Var_297 = null;
                      ^
Mercury/javas/jmercury/opt_format_sign_extend.java:135: error: package string__parse_util does not exist 
    string__parse_util.String_format_int_base_0 Var_308 = null;
                      ^
Mercury/javas/jmercury/opt_format_sign_extend.java:139: error: package string__parse_util does not exist 
    string__parse_util.String_format_int_base_0 Var_319 = null;
                      ^
Mercury/javas/jmercury/opt_format_sign_extend.java:143: error: package string__parse_util does not exist 
    string__parse_util.String_format_int_base_0 Var_330 = null;
                      ^
Mercury/javas/jmercury/opt_format_sign_extend.java:147: error: package string__parse_util does not exist 
    string__parse_util.String_format_int_base_0 Var_341 = null;
                      ^
Mercury/javas/jmercury/opt_format_sign_extend.java:151: error: package string__parse_util does not exist 
    string__parse_util.String_format_int_base_0 Var_352 = null;
                      ^
Mercury/javas/jmercury/opt_format_sign_extend.java:155: error: package string__parse_util does not exist 
    string__parse_util.String_format_int_base_0 Var_363 = null;
                      ^
Mercury/javas/jmercury/opt_format_sign_extend.java:159: error: package string__parse_util does not exist 
    string__parse_util.String_format_int_base_0 Var_374 = null;
                      ^
Mercury/javas/jmercury/opt_format_sign_extend.java:163: error: package string__parse_util does not exist 
    string__parse_util.String_format_int_base_0 Var_385 = null;
                      ^
Mercury/javas/jmercury/opt_format_sign_extend.java:167: error: package string__parse_util does not exist 
    string__parse_util.String_format_int_base_0 Var_396 = null;
                      ^
Mercury/javas/jmercury/opt_format_sign_extend.java:171: error: package string__parse_util does not exist 
    string__parse_util.String_format_int_base_0 Var_407 = null;
                      ^
Mercury/javas/jmercury/opt_format_sign_extend.java:177: error: cannot find symbol 
      Var_10 = int8.min_int8_0_f_0();
               ^
  symbol:   variable int8
  location: class opt_format_sign_extend
Mercury/javas/jmercury/opt_format_sign_extend.java:180: error: cannot find symbol 
      Var_155 = string__format.format_cast_int8_to_uint_2_p_0(Var_10);
                ^
  symbol:   variable string__format
  location: class opt_format_sign_extend
Mercury/javas/jmercury/opt_format_sign_extend.java:182: error: package string__parse_util does not exist 
    Var_162 = (string__parse_util.String_format_flags_0) opt_format_sign_extend.MR_scalar_common_1[0];
                                 ^
Mercury/javas/jmercury/opt_format_sign_extend.java:183: error: package string__parse_util does not exist 
    Var_154 = string__parse_util.String_format_int_base_0.K2;
                                ^
Mercury/javas/jmercury/opt_format_sign_extend.java:185: error: cannot find symbol 
      Var_156 = string__format.format_uint_component_nowidth_noprec_4_p_0(Var_162, Var_154, Var_155);
                ^
  symbol:   variable string__format
  location: class opt_format_sign_extend
Mercury/javas/jmercury/opt_format_sign_extend.java:188: error: cannot find symbol 
      io.write_string_3_p_0(Var_156);
      ^
  symbol:   variable io
  location: class opt_format_sign_extend
Mercury/javas/jmercury/opt_format_sign_extend.java:192: error: cannot find symbol 
      io.write_string_3_p_0(Var_163);
      ^
  symbol:   variable io
  location: class opt_format_sign_extend
Mercury/javas/jmercury/opt_format_sign_extend.java:195: error: cannot find symbol 
      Var_16 = int16.min_int16_0_f_0();
               ^
  symbol:   variable int16
  location: class opt_format_sign_extend
Mercury/javas/jmercury/opt_format_sign_extend.java:198: error: cannot find symbol 
      Var_166 = string__format.format_cast_int16_to_uint_2_p_0(Var_16);
                ^
  symbol:   variable string__format
  location: class opt_format_sign_extend
Mercury/javas/jmercury/opt_format_sign_extend.java:200: error: package string__parse_util does not exist 
    Var_165 = string__parse_util.String_format_int_base_0.K2;
                                ^
Mercury/javas/jmercury/opt_format_sign_extend.java:202: error: cannot find symbol 
      Var_167 = string__format.format_uint_component_nowidth_noprec_4_p_0(Var_162, Var_165, Var_166);
                ^
  symbol:   variable string__format
  location: class opt_format_sign_extend
Mercury/javas/jmercury/opt_format_sign_extend.java:205: error: cannot find symbol 
      io.write_string_3_p_0(Var_167);
      ^
  symbol:   variable io
  location: class opt_format_sign_extend
Mercury/javas/jmercury/opt_format_sign_extend.java:209: error: cannot find symbol 
      io.write_string_3_p_0(Var_174);
      ^
  symbol:   variable io
  location: class opt_format_sign_extend
Mercury/javas/jmercury/opt_format_sign_extend.java:212: error: cannot find symbol 
      Var_22 = int32.min_int32_0_f_0();
               ^
  symbol:   variable int32
  location: class opt_format_sign_extend
Mercury/javas/jmercury/opt_format_sign_extend.java:215: error: cannot find symbol 
      Var_177 = string__format.format_cast_int32_to_uint_2_p_0(Var_22);
                ^
  symbol:   variable string__format
  location: class opt_format_sign_extend
Mercury/javas/jmercury/opt_format_sign_extend.java:217: error: package string__parse_util does not exist 
    Var_176 = string__parse_util.String_format_int_base_0.K2;
                                ^
Mercury/javas/jmercury/opt_format_sign_extend.java:219: error: cannot find symbol 
      Var_178 = string__format.format_uint_component_nowidth_noprec_4_p_0(Var_162, Var_176, Var_177);
                ^
  symbol:   variable string__format
  location: class opt_format_sign_extend
Mercury/javas/jmercury/opt_format_sign_extend.java:222: error: cannot find symbol 
      io.write_string_3_p_0(Var_178);
      ^
  symbol:   variable io
  location: class opt_format_sign_extend
Mercury/javas/jmercury/opt_format_sign_extend.java:226: error: cannot find symbol 
      io.write_string_3_p_0(Var_185);
      ^
  symbol:   variable io
  location: class opt_format_sign_extend
Mercury/javas/jmercury/opt_format_sign_extend.java:230: error: cannot find symbol 
      Var_188 = string__format.format_cast_int8_to_uint_2_p_0(Var_28);
                ^
  symbol:   variable string__format
  location: class opt_format_sign_extend
Mercury/javas/jmercury/opt_format_sign_extend.java:232: error: package string__parse_util does not exist 
    Var_187 = string__parse_util.String_format_int_base_0.K2;
                                ^
Mercury/javas/jmercury/opt_format_sign_extend.java:234: error: cannot find symbol 
      Var_189 = string__format.format_uint_component_nowidth_noprec_4_p_0(Var_162, Var_187, Var_188);
                ^
  symbol:   variable string__format
  location: class opt_format_sign_extend
Mercury/javas/jmercury/opt_format_sign_extend.java:237: error: cannot find symbol 
      io.write_string_3_p_0(Var_189);
      ^
  symbol:   variable io
  location: class opt_format_sign_extend
Mercury/javas/jmercury/opt_format_sign_extend.java:241: error: cannot find symbol 
      io.write_string_3_p_0(Var_196);
      ^
  symbol:   variable io
  location: class opt_format_sign_extend
Mercury/javas/jmercury/opt_format_sign_extend.java:245: error: cannot find symbol 
      Var_199 = string__format.format_cast_int16_to_uint_2_p_0(Var_34);
                ^
  symbol:   variable string__format
  location: class opt_format_sign_extend
Mercury/javas/jmercury/opt_format_sign_extend.java:247: error: package string__parse_util does not exist 
    Var_198 = string__parse_util.String_format_int_base_0.K2;
                                ^
Mercury/javas/jmercury/opt_format_sign_extend.java:249: error: cannot find symbol 
      Var_200 = string__format.format_uint_component_nowidth_noprec_4_p_0(Var_162, Var_198, Var_199);
                ^
  symbol:   variable string__format
  location: class opt_format_sign_extend
Mercury/javas/jmercury/opt_format_sign_extend.java:252: error: cannot find symbol 
      io.write_string_3_p_0(Var_200);
      ^
  symbol:   variable io
  location: class opt_format_sign_extend
Mercury/javas/jmercury/opt_format_sign_extend.java:256: error: cannot find symbol 
      io.write_string_3_p_0(Var_207);
      ^
  symbol:   variable io
  location: class opt_format_sign_extend
Mercury/javas/jmercury/opt_format_sign_extend.java:260: error: cannot find symbol 
      Var_210 = string__format.format_cast_int32_to_uint_2_p_0(Var_40);
                ^
  symbol:   variable string__format
  location: class opt_format_sign_extend
Mercury/javas/jmercury/opt_format_sign_extend.java:262: error: package string__parse_util does not exist 
    Var_209 = string__parse_util.String_format_int_base_0.K2;
                                ^
Mercury/javas/jmercury/opt_format_sign_extend.java:264: error: cannot find symbol 
      Var_211 = string__format.format_uint_component_nowidth_noprec_4_p_0(Var_162, Var_209, Var_210);
                ^
  symbol:   variable string__format
  location: class opt_format_sign_extend
Mercury/javas/jmercury/opt_format_sign_extend.java:267: error: cannot find symbol 
      io.write_string_3_p_0(Var_211);
      ^
  symbol:   variable io
  location: class opt_format_sign_extend
Mercury/javas/jmercury/opt_format_sign_extend.java:271: error: cannot find symbol 
      io.write_string_3_p_0(Var_218);
      ^
  symbol:   variable io
  location: class opt_format_sign_extend
Mercury/javas/jmercury/opt_format_sign_extend.java:274: error: cannot find symbol 
      io.nl_2_p_0();
      ^
  symbol:   variable io
  location: class opt_format_sign_extend
Mercury/javas/jmercury/opt_format_sign_extend.java:277: error: cannot find symbol 
      Var_47 = int8.min_int8_0_f_0();
               ^
  symbol:   variable int8
  location: class opt_format_sign_extend
Mercury/javas/jmercury/opt_format_sign_extend.java:280: error: cannot find symbol 
      Var_221 = string__format.format_cast_int8_to_uint_2_p_0(Var_47);
                ^
  symbol:   variable string__format
  location: class opt_format_sign_extend
Mercury/javas/jmercury/opt_format_sign_extend.java:282: error: package string__parse_util does not exist 
    Var_220 = string__parse_util.String_format_int_base_0.K3;
                                ^
Mercury/javas/jmercury/opt_format_sign_extend.java:284: error: cannot find symbol 
      Var_222 = string__format.format_uint_component_nowidth_noprec_4_p_0(Var_162, Var_220, Var_221);
                ^
  symbol:   variable string__format
  location: class opt_format_sign_extend
Mercury/javas/jmercury/opt_format_sign_extend.java:287: error: cannot find symbol 
      io.write_string_3_p_0(Var_222);
      ^
  symbol:   variable io
  location: class opt_format_sign_extend
Mercury/javas/jmercury/opt_format_sign_extend.java:291: error: cannot find symbol 
      io.write_string_3_p_0(Var_229);
      ^
  symbol:   variable io
  location: class opt_format_sign_extend
Mercury/javas/jmercury/opt_format_sign_extend.java:294: error: cannot find symbol 
      Var_53 = int16.min_int16_0_f_0();
               ^
  symbol:   variable int16
  location: class opt_format_sign_extend
Mercury/javas/jmercury/opt_format_sign_extend.java:297: error: cannot find symbol 
      Var_232 = string__format.format_cast_int16_to_uint_2_p_0(Var_53);
                ^
  symbol:   variable string__format
  location: class opt_format_sign_extend
Mercury/javas/jmercury/opt_format_sign_extend.java:299: error: package string__parse_util does not exist 
    Var_231 = string__parse_util.String_format_int_base_0.K3;
                                ^
Mercury/javas/jmercury/opt_format_sign_extend.java:301: error: cannot find symbol 
      Var_233 = string__format.format_uint_component_nowidth_noprec_4_p_0(Var_162, Var_231, Var_232);
                ^
  symbol:   variable string__format
  location: class opt_format_sign_extend
Mercury/javas/jmercury/opt_format_sign_extend.java:304: error: cannot find symbol 
      io.write_string_3_p_0(Var_233);
      ^
  symbol:   variable io
  location: class opt_format_sign_extend
Mercury/javas/jmercury/opt_format_sign_extend.java:308: error: cannot find symbol 
      io.write_string_3_p_0(Var_240);
      ^
  symbol:   variable io
  location: class opt_format_sign_extend
Mercury/javas/jmercury/opt_format_sign_extend.java:311: error: cannot find symbol 
      Var_59 = int32.min_int32_0_f_0();
               ^
  symbol:   variable int32
  location: class opt_format_sign_extend
Mercury/javas/jmercury/opt_format_sign_extend.java:314: error: cannot find symbol 
      Var_243 = string__format.format_cast_int32_to_uint_2_p_0(Var_59);
                ^
  symbol:   variable string__format
  location: class opt_format_sign_extend
Mercury/javas/jmercury/opt_format_sign_extend.java:316: error: package string__parse_util does not exist 
    Var_242 = string__parse_util.String_format_int_base_0.K3;
                                ^
Mercury/javas/jmercury/opt_format_sign_extend.java:318: error: cannot find symbol 
      Var_244 = string__format.format_uint_component_nowidth_noprec_4_p_0(Var_162, Var_242, Var_243);
                ^
  symbol:   variable string__format
  location: class opt_format_sign_extend
Mercury/javas/jmercury/opt_format_sign_extend.java:321: error: cannot find symbol 
      io.write_string_3_p_0(Var_244);
      ^
  symbol:   variable io
  location: class opt_format_sign_extend
Mercury/javas/jmercury/opt_format_sign_extend.java:325: error: cannot find symbol 
      io.write_string_3_p_0(Var_251);
      ^
  symbol:   variable io
  location: class opt_format_sign_extend
Mercury/javas/jmercury/opt_format_sign_extend.java:329: error: cannot find symbol 
      Var_254 = string__format.format_cast_int8_to_uint_2_p_0(Var_65);
                ^
  symbol:   variable string__format
  location: class opt_format_sign_extend
Mercury/javas/jmercury/opt_format_sign_extend.java:331: error: package string__parse_util does not exist 
    Var_253 = string__parse_util.String_format_int_base_0.K3;
                                ^
Mercury/javas/jmercury/opt_format_sign_extend.java:333: error: cannot find symbol 
      Var_255 = string__format.format_uint_component_nowidth_noprec_4_p_0(Var_162, Var_253, Var_254);
                ^
  symbol:   variable string__format
  location: class opt_format_sign_extend
100 errors
gmake[3]: *** [/tmp/mmake.nD7MLO:2362: opt_format_sign_extend] Error 1
gmake[3]: Target 'opt_format_sign_extend.runtest' not remade because of errors.
gmake[3]: Leaving directory '/home/mercury/testing/run/build/mercury-srcdist-rotd-2025-03-30/tests/hard_coded'