MERCURY_OPTIONS=
gmake[3]: Entering directory '/home/mercury/testing/run/build/mercury-srcdist-rotd-2025-03-30/tests/valid'
{ echo MCFLAGS += '--grade java    --options-file /home/mercury/testing/run/build/mercury-srcdist-rotd-2025-03-30/stage2/Mercury.options --mercury-linkage static -j2 --flags ../TESTS_FLAGS --flags ../WS_FLAGS --use-subdirs  --infer-all  '; echo MCFLAGS += ' '; echo CFLAGS += '    '; echo JAVACFLAGS += '-J"-Xmx1024m"   '; echo CSCFLAGS += '   '; echo C2INITARGS += '/home/mercury/testing/run/build/mercury-srcdist-rotd-2025-03-30/stage2/library/mer_std.init /home/mercury/testing/run/build/mercury-srcdist-rotd-2025-03-30/stage2/runtime/mer_rt.init    '; echo MLLIBS += '   '; echo MLOBJS += '  '; echo LDFLAGS += '  '; echo LD_LIBFLAGS += '  '; echo EXTRA_LIBRARIES += ''; echo EXTRA_LIB_DIRS += ''; echo LIBGRADES = 'hlc.gc  '; echo INSTALL_PREFIX = '/home/mercury/testing/run/install'; echo LINKAGE = 'shared'; echo MERCURY_LINKAGE = 'shared'; } | /home/mercury/testing/run/build/mercury-srcdist-rotd-2025-03-30/stage2/scripts/mmc --make --options-file - mpj_6.depend
gmake[3]: Leaving directory '/home/mercury/testing/run/build/mercury-srcdist-rotd-2025-03-30/tests/valid'
gmake[3]: Entering directory '/home/mercury/testing/run/build/mercury-srcdist-rotd-2025-03-30/tests/valid'
{ echo MCFLAGS += '--grade java    --options-file /home/mercury/testing/run/build/mercury-srcdist-rotd-2025-03-30/stage2/Mercury.options --mercury-linkage static -j2 --flags ../TESTS_FLAGS --flags ../WS_FLAGS --use-subdirs  --infer-all  '; echo MCFLAGS += ' '; echo CFLAGS += '    '; echo JAVACFLAGS += '-J"-Xmx1024m"   '; echo CSCFLAGS += '   '; echo C2INITARGS += '/home/mercury/testing/run/build/mercury-srcdist-rotd-2025-03-30/stage2/library/mer_std.init /home/mercury/testing/run/build/mercury-srcdist-rotd-2025-03-30/stage2/runtime/mer_rt.init    '; echo MLLIBS += '   '; echo MLOBJS += '  '; echo LDFLAGS += '  '; echo LD_LIBFLAGS += '  '; echo EXTRA_LIBRARIES += ''; echo EXTRA_LIB_DIRS += ''; echo LIBGRADES = 'hlc.gc  '; echo INSTALL_PREFIX = '/home/mercury/testing/run/install'; echo LINKAGE = 'shared'; echo MERCURY_LINKAGE = 'shared'; } | /home/mercury/testing/run/build/mercury-srcdist-rotd-2025-03-30/stage2/scripts/mmc --make --options-file - mpj_6.class
Making Mercury/int3s/mpj_6.int3
Making Mercury/ints/mpj_6.int
Making Mercury/javas/jmercury/mpj_6.java
mpj_6.m:034: Inferred :- func f(E, E, T4) = T4 <= (mpj_6.coll(E, T4)).
Making Mercury/classes/jmercury/mpj_6.class
Mercury/javas/jmercury/mpj_6.java:15: error: package jmercury.runtime does not exist 
  private static final jmercury.runtime.DuFunctorDesc mpj_6__du_functor_desc_intlist_0_0 = new jmercury.runtime.DuFunctorDesc();
                                       ^
Mercury/javas/jmercury/mpj_6.java:16: error: package jmercury.runtime does not exist 
  private static final jmercury.runtime.PseudoTypeInfo[] mpj_6__field_types_intlist_0_1 = new jmercury.runtime.PseudoTypeInfo[2];
                                       ^
Mercury/javas/jmercury/mpj_6.java:17: error: package jmercury.runtime does not exist 
  private static final jmercury.runtime.DuFunctorDesc mpj_6__du_functor_desc_intlist_0_1 = new jmercury.runtime.DuFunctorDesc();
                                       ^
Mercury/javas/jmercury/mpj_6.java:18: error: package jmercury.runtime does not exist 
  private static final jmercury.runtime.DuFunctorDesc[] mpj_6__du_stag_ordered_intlist_0_0 = new jmercury.runtime.DuFunctorDesc[2];
                                       ^
Mercury/javas/jmercury/mpj_6.java:19: error: package jmercury.runtime does not exist 
  private static final jmercury.runtime.DuPtagLayout[] mpj_6__du_ptag_ordered_intlist_0 = new jmercury.runtime.DuPtagLayout[1];
                                       ^
Mercury/javas/jmercury/mpj_6.java:20: error: package jmercury.runtime does not exist 
  private static final jmercury.runtime.DuFunctorDesc[] mpj_6__du_name_ordered_intlist_0 = new jmercury.runtime.DuFunctorDesc[2];
                                       ^
Mercury/javas/jmercury/mpj_6.java:22: error: package jmercury.runtime does not exist 
  public static final jmercury.runtime.TypeCtorInfo_Struct mpj_6__type_ctor_info_intlist_0 = new jmercury.runtime.TypeCtorInfo_Struct();
                                      ^
Mercury/javas/jmercury/mpj_6.java:23: error: package jmercury.runtime does not exist 
  private static final jmercury.runtime.DuFunctorDesc mpj_6__du_functor_desc_stringlist_0_0 = new jmercury.runtime.DuFunctorDesc();
                                       ^
Mercury/javas/jmercury/mpj_6.java:24: error: package jmercury.runtime does not exist 
  private static final jmercury.runtime.PseudoTypeInfo[] mpj_6__field_types_stringlist_0_1 = new jmercury.runtime.PseudoTypeInfo[2];
                                       ^
Mercury/javas/jmercury/mpj_6.java:25: error: package jmercury.runtime does not exist 
  private static final jmercury.runtime.DuFunctorDesc mpj_6__du_functor_desc_stringlist_0_1 = new jmercury.runtime.DuFunctorDesc();
                                       ^
Mercury/javas/jmercury/mpj_6.java:26: error: package jmercury.runtime does not exist 
  private static final jmercury.runtime.DuFunctorDesc[] mpj_6__du_stag_ordered_stringlist_0_0 = new jmercury.runtime.DuFunctorDesc[2];
                                       ^
Mercury/javas/jmercury/mpj_6.java:27: error: package jmercury.runtime does not exist 
  private static final jmercury.runtime.DuPtagLayout[] mpj_6__du_ptag_ordered_stringlist_0 = new jmercury.runtime.DuPtagLayout[1];
                                       ^
Mercury/javas/jmercury/mpj_6.java:28: error: package jmercury.runtime does not exist 
  private static final jmercury.runtime.DuFunctorDesc[] mpj_6__du_name_ordered_stringlist_0 = new jmercury.runtime.DuFunctorDesc[2];
                                       ^
Mercury/javas/jmercury/mpj_6.java:30: error: package jmercury.runtime does not exist 
  public static final jmercury.runtime.TypeCtorInfo_Struct mpj_6__type_ctor_info_stringlist_0 = new jmercury.runtime.TypeCtorInfo_Struct();
                                      ^
Mercury/javas/jmercury/mpj_6.java:34: error: package jmercury.runtime does not exist 
  private static final jmercury.runtime.TypeClassMethod[] mpj_6__type_class_id_method_ids_coll_2 = new jmercury.runtime.TypeClassMethod[1];
                                       ^
Mercury/javas/jmercury/mpj_6.java:35: error: package jmercury.runtime does not exist 
  private static final jmercury.runtime.TypeClassId mpj_6__type_class_id_coll_2 = new jmercury.runtime.TypeClassId();
                                       ^
Mercury/javas/jmercury/mpj_6.java:36: error: package jmercury.runtime does not exist 
  public static final jmercury.runtime.TypeClassDeclStruct mpj_6__type_class_decl_coll_2 = new jmercury.runtime.TypeClassDeclStruct();
                                      ^
Mercury/javas/jmercury/mpj_6.java:818: error: package jmercury.runtime does not exist 
    implements jmercury.runtime.MercuryType
                               ^
Mercury/javas/jmercury/mpj_6.java:857: error: package jmercury.runtime does not exist 
    implements jmercury.runtime.MercuryType
                               ^
Mercury/javas/jmercury/mpj_6.java:424: error: package builtin does not exist 
  public static builtin.Comparison_result_0
                       ^
Mercury/javas/jmercury/mpj_6.java:501: error: package builtin does not exist 
  public static builtin.Comparison_result_0
                       ^
Mercury/javas/jmercury/mpj_6.java:694: error: package jmercury.runtime does not exist 
    implements jmercury.runtime.MethodPtr2
                               ^
Mercury/javas/jmercury/mpj_6.java:754: error: package jmercury.runtime does not exist 
    implements jmercury.runtime.MethodPtr3
                               ^
Mercury/javas/jmercury/mpj_6.java:797: error: package jmercury.runtime does not exist 
    implements jmercury.runtime.MethodPtr4
                               ^
Mercury/javas/jmercury/mpj_6.java:15: error: package jmercury.runtime does not exist 
  private static final jmercury.runtime.DuFunctorDesc mpj_6__du_functor_desc_intlist_0_0 = new jmercury.runtime.DuFunctorDesc();
                                                                                                               ^
Mercury/javas/jmercury/mpj_6.java:16: error: package jmercury.runtime does not exist 
  private static final jmercury.runtime.PseudoTypeInfo[] mpj_6__field_types_intlist_0_1 = new jmercury.runtime.PseudoTypeInfo[2];
                                                                                                              ^
Mercury/javas/jmercury/mpj_6.java:17: error: package jmercury.runtime does not exist 
  private static final jmercury.runtime.DuFunctorDesc mpj_6__du_functor_desc_intlist_0_1 = new jmercury.runtime.DuFunctorDesc();
                                                                                                               ^
Mercury/javas/jmercury/mpj_6.java:18: error: package jmercury.runtime does not exist 
  private static final jmercury.runtime.DuFunctorDesc[] mpj_6__du_stag_ordered_intlist_0_0 = new jmercury.runtime.DuFunctorDesc[2];
                                                                                                                 ^
Mercury/javas/jmercury/mpj_6.java:19: error: package jmercury.runtime does not exist 
  private static final jmercury.runtime.DuPtagLayout[] mpj_6__du_ptag_ordered_intlist_0 = new jmercury.runtime.DuPtagLayout[1];
                                                                                                              ^
Mercury/javas/jmercury/mpj_6.java:20: error: package jmercury.runtime does not exist 
  private static final jmercury.runtime.DuFunctorDesc[] mpj_6__du_name_ordered_intlist_0 = new jmercury.runtime.DuFunctorDesc[2];
                                                                                                               ^
Mercury/javas/jmercury/mpj_6.java:22: error: package jmercury.runtime does not exist 
  public static final jmercury.runtime.TypeCtorInfo_Struct mpj_6__type_ctor_info_intlist_0 = new jmercury.runtime.TypeCtorInfo_Struct();
                                                                                                                 ^
Mercury/javas/jmercury/mpj_6.java:23: error: package jmercury.runtime does not exist 
  private static final jmercury.runtime.DuFunctorDesc mpj_6__du_functor_desc_stringlist_0_0 = new jmercury.runtime.DuFunctorDesc();
                                                                                                                  ^
Mercury/javas/jmercury/mpj_6.java:24: error: package jmercury.runtime does not exist 
  private static final jmercury.runtime.PseudoTypeInfo[] mpj_6__field_types_stringlist_0_1 = new jmercury.runtime.PseudoTypeInfo[2];
                                                                                                                 ^
Mercury/javas/jmercury/mpj_6.java:25: error: package jmercury.runtime does not exist 
  private static final jmercury.runtime.DuFunctorDesc mpj_6__du_functor_desc_stringlist_0_1 = new jmercury.runtime.DuFunctorDesc();
                                                                                                                  ^
Mercury/javas/jmercury/mpj_6.java:26: error: package jmercury.runtime does not exist 
  private static final jmercury.runtime.DuFunctorDesc[] mpj_6__du_stag_ordered_stringlist_0_0 = new jmercury.runtime.DuFunctorDesc[2];
                                                                                                                    ^
Mercury/javas/jmercury/mpj_6.java:27: error: package jmercury.runtime does not exist 
  private static final jmercury.runtime.DuPtagLayout[] mpj_6__du_ptag_ordered_stringlist_0 = new jmercury.runtime.DuPtagLayout[1];
                                                                                                                 ^
Mercury/javas/jmercury/mpj_6.java:28: error: package jmercury.runtime does not exist 
  private static final jmercury.runtime.DuFunctorDesc[] mpj_6__du_name_ordered_stringlist_0 = new jmercury.runtime.DuFunctorDesc[2];
                                                                                                                  ^
Mercury/javas/jmercury/mpj_6.java:30: error: package jmercury.runtime does not exist 
  public static final jmercury.runtime.TypeCtorInfo_Struct mpj_6__type_ctor_info_stringlist_0 = new jmercury.runtime.TypeCtorInfo_Struct();
                                                                                                                    ^
Mercury/javas/jmercury/mpj_6.java:34: error: package jmercury.runtime does not exist 
  private static final jmercury.runtime.TypeClassMethod[] mpj_6__type_class_id_method_ids_coll_2 = new jmercury.runtime.TypeClassMethod[1];
                                                                                                                       ^
Mercury/javas/jmercury/mpj_6.java:35: error: package jmercury.runtime does not exist 
  private static final jmercury.runtime.TypeClassId mpj_6__type_class_id_coll_2 = new jmercury.runtime.TypeClassId();
                                                                                                      ^
Mercury/javas/jmercury/mpj_6.java:36: error: package jmercury.runtime does not exist 
  public static final jmercury.runtime.TypeClassDeclStruct mpj_6__type_class_decl_coll_2 = new jmercury.runtime.TypeClassDeclStruct();
                                                                                                               ^
Mercury/javas/jmercury/mpj_6.java:44: error: cannot find symbol 
      private_builtin.MR_SECTAG_REMOTE_FULL_WORD,
      ^
  symbol:   variable private_builtin
  location: class mpj_6
Mercury/javas/jmercury/mpj_6.java:52: error: cannot find symbol 
      private_builtin.MR_FUNCTOR_SUBTYPE_NONE,
      ^
  symbol:   variable private_builtin
  location: class mpj_6
Mercury/javas/jmercury/mpj_6.java:56: error: package jmercury.runtime does not exist 
      (jmercury.runtime.PseudoTypeInfo) builtin.builtin__type_ctor_info_int_0;
                       ^
Mercury/javas/jmercury/mpj_6.java:56: error: cannot find symbol 
      (jmercury.runtime.PseudoTypeInfo) builtin.builtin__type_ctor_info_int_0;
                                        ^
  symbol:   variable builtin
  location: class mpj_6
Mercury/javas/jmercury/mpj_6.java:58: error: package jmercury.runtime does not exist 
      (jmercury.runtime.PseudoTypeInfo) mpj_6.mpj_6__type_ctor_info_intlist_0;
                       ^
Mercury/javas/jmercury/mpj_6.java:63: error: cannot find symbol 
      private_builtin.MR_SECTAG_REMOTE_FULL_WORD,
      ^
  symbol:   variable private_builtin
  location: class mpj_6
Mercury/javas/jmercury/mpj_6.java:71: error: cannot find symbol 
      private_builtin.MR_FUNCTOR_SUBTYPE_NONE,
      ^
  symbol:   variable private_builtin
  location: class mpj_6
Mercury/javas/jmercury/mpj_6.java:79: error: package jmercury.runtime does not exist 
      new jmercury.runtime.DuPtagLayout(
                          ^
Mercury/javas/jmercury/mpj_6.java:81: error: cannot find symbol 
        private_builtin.MR_SECTAG_REMOTE_FULL_WORD,
        ^
  symbol:   variable private_builtin
  location: class mpj_6
Mercury/javas/jmercury/mpj_6.java:99: error: package jmercury.runtime does not exist 
      jmercury.runtime.TypeCtorRep.MR_TYPECTOR_REP_DU,
                      ^
Mercury/javas/jmercury/mpj_6.java:104: error: package jmercury.runtime does not exist 
      new jmercury.runtime.TypeFunctors(
                          ^
Mercury/javas/jmercury/mpj_6.java:107: error: package jmercury.runtime does not exist 
      new jmercury.runtime.TypeLayout(
                          ^
Mercury/javas/jmercury/mpj_6.java:119: error: cannot find symbol 
      private_builtin.MR_SECTAG_REMOTE_FULL_WORD,
      ^
  symbol:   variable private_builtin
  location: class mpj_6
Mercury/javas/jmercury/mpj_6.java:127: error: cannot find symbol 
      private_builtin.MR_FUNCTOR_SUBTYPE_NONE,
      ^
  symbol:   variable private_builtin
  location: class mpj_6
Mercury/javas/jmercury/mpj_6.java:131: error: package jmercury.runtime does not exist 
      (jmercury.runtime.PseudoTypeInfo) builtin.builtin__type_ctor_info_string_0;
                       ^
Mercury/javas/jmercury/mpj_6.java:131: error: cannot find symbol 
      (jmercury.runtime.PseudoTypeInfo) builtin.builtin__type_ctor_info_string_0;
                                        ^
  symbol:   variable builtin
  location: class mpj_6
Mercury/javas/jmercury/mpj_6.java:133: error: package jmercury.runtime does not exist 
      (jmercury.runtime.PseudoTypeInfo) mpj_6.mpj_6__type_ctor_info_stringlist_0;
                       ^
Mercury/javas/jmercury/mpj_6.java:138: error: cannot find symbol 
      private_builtin.MR_SECTAG_REMOTE_FULL_WORD,
      ^
  symbol:   variable private_builtin
  location: class mpj_6
Mercury/javas/jmercury/mpj_6.java:146: error: cannot find symbol 
      private_builtin.MR_FUNCTOR_SUBTYPE_NONE,
      ^
  symbol:   variable private_builtin
  location: class mpj_6
Mercury/javas/jmercury/mpj_6.java:154: error: package jmercury.runtime does not exist 
      new jmercury.runtime.DuPtagLayout(
                          ^
Mercury/javas/jmercury/mpj_6.java:156: error: cannot find symbol 
        private_builtin.MR_SECTAG_REMOTE_FULL_WORD,
        ^
  symbol:   variable private_builtin
  location: class mpj_6
Mercury/javas/jmercury/mpj_6.java:174: error: package jmercury.runtime does not exist 
      jmercury.runtime.TypeCtorRep.MR_TYPECTOR_REP_DU,
                      ^
Mercury/javas/jmercury/mpj_6.java:179: error: package jmercury.runtime does not exist 
      new jmercury.runtime.TypeFunctors(
                          ^
Mercury/javas/jmercury/mpj_6.java:182: error: package jmercury.runtime does not exist 
      new jmercury.runtime.TypeLayout(
                          ^
Mercury/javas/jmercury/mpj_6.java:219: error: package jmercury.runtime does not exist 
      new jmercury.runtime.TypeClassMethod(
                          ^
Mercury/javas/jmercury/mpj_6.java:222: error: cannot find symbol 
        private_builtin.MR_FUNCTION
        ^
  symbol:   variable private_builtin
  location: class mpj_6
Mercury/javas/jmercury/mpj_6.java:254: error: cannot find symbol 
        ((java.lang.Object) (jmercury.runtime.TypeInfo_Struct.maybe_new(builtin.builtin__type_ctor_info_int_0))),
                                                                        ^
  symbol:   variable builtin
  location: class mpj_6
Mercury/javas/jmercury/mpj_6.java:254: error: package jmercury.runtime does not exist 
        ((java.lang.Object) (jmercury.runtime.TypeInfo_Struct.maybe_new(builtin.builtin__type_ctor_info_int_0))),
                                             ^
Mercury/javas/jmercury/mpj_6.java:255: error: package jmercury.runtime does not exist 
        ((java.lang.Object) (jmercury.runtime.TypeInfo_Struct.maybe_new(mpj_6.mpj_6__type_ctor_info_intlist_0)))
                                             ^
Mercury/javas/jmercury/mpj_6.java:262: error: cannot find symbol 
        ((java.lang.Object) (builtin.builtin__type_ctor_info_int_0)),
                             ^
  symbol:   variable builtin
  location: class mpj_6
Mercury/javas/jmercury/mpj_6.java:262: error: illegal start of type 
        ((java.lang.Object) (builtin.builtin__type_ctor_info_int_0)),
                            ^
Mercury/javas/jmercury/mpj_6.java:263: error: cannot find symbol 
        ((java.lang.Object) (builtin.builtin__type_ctor_info_int_0)),
                             ^
  symbol:   variable builtin
  location: class mpj_6
Mercury/javas/jmercury/mpj_6.java:263: error: illegal start of type 
        ((java.lang.Object) (builtin.builtin__type_ctor_info_int_0)),
                            ^
Mercury/javas/jmercury/mpj_6.java:356: error: package jmercury.runtime does not exist 
    jmercury.runtime.MethodPtr func_0 = ((jmercury.runtime.MethodPtr) ((java.lang.Object[]) ((java.lang.Object[]) TypeClassInfo_for_coll_12)[0])[5]);
                    ^
Mercury/javas/jmercury/mpj_6.java:356: error: package jmercury.runtime does not exist 
    jmercury.runtime.MethodPtr func_0 = ((jmercury.runtime.MethodPtr) ((java.lang.Object[]) ((java.lang.Object[]) TypeClassInfo_for_coll_12)[0])[5]);
                                                          ^
Mercury/javas/jmercury/mpj_6.java:358: error: package jmercury.runtime does not exist 
    jmercury.runtime.MethodPtr func_2 = null;
                    ^
Mercury/javas/jmercury/mpj_6.java:362: error: package jmercury.runtime does not exist 
      conv1_Var_13 = ((java.lang.Object) ((jmercury.runtime.MethodPtr3) func_0).call___0_0(((java.lang.Object) (((/* generic_type */ java.lang.Object) TypeClassInfo_for_coll_12))), ((java.lang.Object) (java.lang.Integer.valueOf(HeadVar__2_9))), ((java.lang.Object) (((java.lang.Object) (HeadVar__3_10))))));
                                                           ^
Mercury/javas/jmercury/mpj_6.java:365: error: package jmercury.runtime does not exist 
    func_2 = ((jmercury.runtime.MethodPtr) ((java.lang.Object[]) ((java.lang.Object[]) TypeClassInfo_for_coll_12)[0])[5]);
                               ^
Mercury/javas/jmercury/mpj_6.java:367: error: package jmercury.runtime does not exist 
      conv3_HeadVar__4_11 = ((java.lang.Object) ((jmercury.runtime.MethodPtr3) func_2).call___0_0(((java.lang.Object) (((/* generic_type */ java.lang.Object) TypeClassInfo_for_coll_12))), ((java.lang.Object) (java.lang.Integer.valueOf(HeadVar__1_8))), ((java.lang.Object) (((java.lang.Object) (Var_13))))));
                                                                  ^
Mercury/javas/jmercury/mpj_6.java:381: error: package jmercury.runtime does not exist 
    jmercury.runtime.MethodPtr func_1 = ((jmercury.runtime.MethodPtr) ((java.lang.Object[]) Var_4)[1]);
                    ^
Mercury/javas/jmercury/mpj_6.java:381: error: package jmercury.runtime does not exist 
    jmercury.runtime.MethodPtr func_1 = ((jmercury.runtime.MethodPtr) ((java.lang.Object[]) Var_4)[1]);
                                                          ^
Mercury/javas/jmercury/mpj_6.java:385: error: package jmercury.runtime does not exist 
      conv2_HeadVar__2_2 = ((java.lang.Object) ((jmercury.runtime.MethodPtr4) func_1).call___0_0(((java.lang.Object) (((/* generic_type */ java.lang.Object) Var_4))), ((java.lang.Object) (java.lang.Integer.valueOf(Var_5))), ((java.lang.Object) (java.lang.Integer.valueOf(Var_6))), ((java.lang.Object) (((java.lang.Object) (L_3))))));
                                                                 ^
Mercury/javas/jmercury/mpj_6.java:416: error: package jmercury.runtime does not exist 
    jmercury.runtime.MethodPtr func_0 = ((jmercury.runtime.MethodPtr) ((java.lang.Object[]) ((java.lang.Object[]) TypeClassInfo_for_coll_4)[0])[5]);
                    ^
Mercury/javas/jmercury/mpj_6.java:416: error: package jmercury.runtime does not exist 
    jmercury.runtime.MethodPtr func_0 = ((jmercury.runtime.MethodPtr) ((java.lang.Object[]) ((java.lang.Object[]) TypeClassInfo_for_coll_4)[0])[5]);
                                                          ^
Mercury/javas/jmercury/mpj_6.java:419: error: package jmercury.runtime does not exist 
      HeadVar__3_3 = ((java.lang.Object) ((jmercury.runtime.MethodPtr3) func_0).call___0_0(((java.lang.Object) (((/* generic_type */ java.lang.Object) TypeClassInfo_for_coll_4))), ((java.lang.Object) (HeadVar__1_1)), ((java.lang.Object) (HeadVar__2_2))));
                                                           ^
Mercury/javas/jmercury/mpj_6.java:432: error: package builtin does not exist 
      builtin.Comparison_result_0 HeadVar__1_1 = null;
             ^
Mercury/javas/jmercury/mpj_6.java:439: error: package builtin does not exist 
        HeadVar__1_1 = builtin.Comparison_result_0.K0;
                              ^
Mercury/javas/jmercury/mpj_6.java:443: error: package builtin does not exist 
            HeadVar__1_1 = builtin.Comparison_result_0.K0;
                                  ^
Mercury/javas/jmercury/mpj_6.java:445: error: package builtin does not exist 
            HeadVar__1_1 = builtin.Comparison_result_0.K1;
                                  ^
Mercury/javas/jmercury/mpj_6.java:448: error: package builtin does not exist 
            HeadVar__1_1 = builtin.Comparison_result_0.K2;
                                  ^
Mercury/javas/jmercury/mpj_6.java:455: error: package builtin does not exist 
            builtin.Comparison_result_0 SubResult1_6 = null;
                   ^
Mercury/javas/jmercury/mpj_6.java:459: error: package builtin does not exist 
              SubResult1_6 = builtin.Comparison_result_0.K1;
                                    ^
Mercury/javas/jmercury/mpj_6.java:464: error: package builtin does not exist 
                SubResult1_6 = builtin.Comparison_result_0.K2;
                                      ^
Mercury/javas/jmercury/mpj_6.java:466: error: package builtin does not exist 
                SubResult1_6 = builtin.Comparison_result_0.K0;
                                      ^
Mercury/javas/jmercury/mpj_6.java:468: error: package builtin.Comparison_result_0 does not exist 
            succeeded = (SubResult1_6.MR_value != builtin.Comparison_result_0.K0.MR_value);
                                                                             ^
Mercury/javas/jmercury/mpj_6.java:492: error: package builtin does not exist 
    builtin.Comparison_result_0 conv0_HeadVar__1_1 = null;
           ^
Mercury/javas/jmercury/mpj_6.java:509: error: package builtin does not exist 
      builtin.Comparison_result_0 HeadVar__1_1 = null;
             ^
Mercury/javas/jmercury/mpj_6.java:516: error: package builtin does not exist 
        HeadVar__1_1 = builtin.Comparison_result_0.K0;
                              ^
Mercury/javas/jmercury/mpj_6.java:520: error: package builtin does not exist 
            HeadVar__1_1 = builtin.Comparison_result_0.K0;
                                  ^
100 errors
** Error making `Mercury/classes/jmercury/mpj_6.class'.
gmake[3]: *** [/tmp/mmake.QO731L:1497: mpj_6.class] Error 1
gmake[3]: Target 'mpj_6.runtest' not remade because of errors.
gmake[3]: Leaving directory '/home/mercury/testing/run/build/mercury-srcdist-rotd-2025-03-30/tests/valid'
ERROR OUTPUT
mpj_6.m:034: Inferred :- func f(E, E, T4) = T4 <= (mpj_6.coll(E, T4)).
END OF THE ERROR OUTPUT