MERCURY_OPTIONS=
gmake[3]: Entering directory '/home/mercury/testing/run/build/mercury-srcdist-rotd-2025-03-30/tests/hard_coded'
{ echo MCFLAGS += '--grade java    --options-file /home/mercury/testing/run/build/mercury-srcdist-rotd-2025-03-30/stage2/Mercury.options --mercury-linkage static -j2 --flags ../TESTS_FLAGS --flags ../WS_FLAGS --use-subdirs    '; echo MCFLAGS += ' '; echo CFLAGS += '    '; echo JAVACFLAGS += '-J"-Xmx1024m"   '; echo CSCFLAGS += '   '; echo C2INITARGS += '/home/mercury/testing/run/build/mercury-srcdist-rotd-2025-03-30/stage2/library/mer_std.init /home/mercury/testing/run/build/mercury-srcdist-rotd-2025-03-30/stage2/runtime/mer_rt.init    '; echo MLLIBS += '   '; echo MLOBJS += '  '; echo LDFLAGS += '  '; echo LD_LIBFLAGS += '  '; echo EXTRA_LIBRARIES += ''; echo EXTRA_LIB_DIRS += ''; echo LIBGRADES = 'hlc.gc  '; echo INSTALL_PREFIX = '/home/mercury/testing/run/install'; echo LINKAGE = 'shared'; echo MERCURY_LINKAGE = 'shared'; } | /home/mercury/testing/run/build/mercury-srcdist-rotd-2025-03-30/stage2/scripts/mmc --make --options-file - bit_access_uint16.depend
gmake[3]: Leaving directory '/home/mercury/testing/run/build/mercury-srcdist-rotd-2025-03-30/tests/hard_coded'
gmake[3]: Entering directory '/home/mercury/testing/run/build/mercury-srcdist-rotd-2025-03-30/tests/hard_coded'
{ echo MCFLAGS += '--grade java    --options-file /home/mercury/testing/run/build/mercury-srcdist-rotd-2025-03-30/stage2/Mercury.options --mercury-linkage static -j2 --flags ../TESTS_FLAGS --flags ../WS_FLAGS --use-subdirs    '; echo MCFLAGS += ' '; echo CFLAGS += '    '; echo JAVACFLAGS += '-J"-Xmx1024m"   '; echo CSCFLAGS += '   '; echo C2INITARGS += '/home/mercury/testing/run/build/mercury-srcdist-rotd-2025-03-30/stage2/library/mer_std.init /home/mercury/testing/run/build/mercury-srcdist-rotd-2025-03-30/stage2/runtime/mer_rt.init    '; echo MLLIBS += '   '; echo MLOBJS += '  '; echo LDFLAGS += '  '; echo LD_LIBFLAGS += '  '; echo EXTRA_LIBRARIES += ''; echo EXTRA_LIB_DIRS += ''; echo LIBGRADES = 'hlc.gc  '; echo INSTALL_PREFIX = '/home/mercury/testing/run/install'; echo LINKAGE = 'shared'; echo MERCURY_LINKAGE = 'shared'; } | /home/mercury/testing/run/build/mercury-srcdist-rotd-2025-03-30/stage2/scripts/mmc --make --options-file - bit_access_uint16
Making Mercury/int3s/bit_access_uint16.int3
Making Mercury/ints/bit_access_uint16.int
Making Mercury/javas/jmercury/bit_access_uint16.java
Making Java class files
Mercury/javas/jmercury/bit_access_uint16.java:32: error: package jmercury.runtime does not exist 
  private static final jmercury.runtime.TypeInfo_Struct __vpti_func_3__plain_builtin__type_ctor_info_uint16_0__plain_builtin__type_ctor_info_uint_0__plain_builtin__type_ctor_info_uint16_0 = new jmercury.runtime.TypeInfo_Struct();
                                       ^
Mercury/javas/jmercury/bit_access_uint16.java:33: error: package jmercury.runtime does not exist 
  private static final jmercury.runtime.TypeInfo_Struct __vpti_pred_2__plain_builtin__type_ctor_info_uint16_0__plain_builtin__type_ctor_info_uint_0 = new jmercury.runtime.TypeInfo_Struct();
                                       ^
Mercury/javas/jmercury/bit_access_uint16.java:34: error: package jmercury.runtime does not exist 
  private static final jmercury.runtime.TypeInfo_Struct __vpti_tuple_1__plain_builtin__type_ctor_info_uint16_0 = new jmercury.runtime.TypeInfo_Struct();
                                       ^
Mercury/javas/jmercury/bit_access_uint16.java:35: error: package jmercury.runtime does not exist 
  private static final jmercury.runtime.TypeInfo_Struct __vpti_tuple_0 = new jmercury.runtime.TypeInfo_Struct();
                                       ^
Mercury/javas/jmercury/bit_access_uint16.java:71: error: package jmercury.runtime does not exist 
  private static final jmercury.runtime.TypeInfo_Struct[] MR_scalar_common_1 = new jmercury.runtime.TypeInfo_Struct[1];
                                       ^
Mercury/javas/jmercury/bit_access_uint16.java:73: error: package list.List_1 does not exist 
  private static final list.List_1.F_nil_0[] MR_scalar_common_3 = new list.List_1.F_nil_0[1];
                                  ^
Mercury/javas/jmercury/bit_access_uint16.java:74: error: package list.List_1 does not exist 
  private static final list.List_1.F_cons_2[] MR_scalar_common_4 = new list.List_1.F_cons_2[13];
                                  ^
Mercury/javas/jmercury/bit_access_uint16.java:80: error: package string__parse_util does not exist 
  private static final string__parse_util.String_format_flags_0[] MR_scalar_common_10 = new string__parse_util.String_format_flags_0[1];
                                         ^
Mercury/javas/jmercury/bit_access_uint16.java:956: error: package jmercury.runtime does not exist 
    implements jmercury.runtime.MethodPtr1
                               ^
Mercury/javas/jmercury/bit_access_uint16.java:997: error: package jmercury.runtime does not exist 
    implements jmercury.runtime.MethodPtr3
                               ^
Mercury/javas/jmercury/bit_access_uint16.java:15: error: package jmercury.runtime does not exist 
    jmercury.runtime.JavaInternal.progname = "bit_access_uint16";
                    ^
Mercury/javas/jmercury/bit_access_uint16.java:16: error: package jmercury.runtime does not exist 
    jmercury.runtime.JavaInternal.args = args;
                    ^
Mercury/javas/jmercury/bit_access_uint16.java:17: error: package jmercury.runtime does not exist 
    jmercury.runtime.JavaInternal.exit_status = 0;
                    ^
Mercury/javas/jmercury/bit_access_uint16.java:18: error: cannot find symbol 
    library.ML_std_library_init();
    ^
  symbol:   variable library
  location: class bit_access_uint16
Mercury/javas/jmercury/bit_access_uint16.java:19: error: cannot find symbol 
    benchmarking.ML_initialise();
    ^
  symbol:   variable benchmarking
  location: class bit_access_uint16
Mercury/javas/jmercury/bit_access_uint16.java:25: error: package jmercury.runtime does not exist 
    jmercury.runtime.JavaInternal.runMain(run_main);
                    ^
Mercury/javas/jmercury/bit_access_uint16.java:26: error: cannot find symbol 
    io.flush_output_3_p_0(io.stdout_stream_0_f_0());
                          ^
  symbol:   variable io
  location: class bit_access_uint16
Mercury/javas/jmercury/bit_access_uint16.java:26: error: cannot find symbol 
    io.flush_output_3_p_0(io.stdout_stream_0_f_0());
    ^
  symbol:   variable io
  location: class bit_access_uint16
Mercury/javas/jmercury/bit_access_uint16.java:27: error: cannot find symbol 
    io.flush_output_3_p_0(io.stderr_stream_0_f_0());
                          ^
  symbol:   variable io
  location: class bit_access_uint16
Mercury/javas/jmercury/bit_access_uint16.java:27: error: cannot find symbol 
    io.flush_output_3_p_0(io.stderr_stream_0_f_0());
    ^
  symbol:   variable io
  location: class bit_access_uint16
Mercury/javas/jmercury/bit_access_uint16.java:28: error: package jmercury.runtime does not exist 
    java.lang.System.exit(jmercury.runtime.JavaInternal.exit_status);
                                          ^
Mercury/javas/jmercury/bit_access_uint16.java:32: error: package jmercury.runtime does not exist 
  private static final jmercury.runtime.TypeInfo_Struct __vpti_func_3__plain_builtin__type_ctor_info_uint16_0__plain_builtin__type_ctor_info_uint_0__plain_builtin__type_ctor_info_uint16_0 = new jmercury.runtime.TypeInfo_Struct();
                                                                                                                                                                                                                  ^
Mercury/javas/jmercury/bit_access_uint16.java:33: error: package jmercury.runtime does not exist 
  private static final jmercury.runtime.TypeInfo_Struct __vpti_pred_2__plain_builtin__type_ctor_info_uint16_0__plain_builtin__type_ctor_info_uint_0 = new jmercury.runtime.TypeInfo_Struct();
                                                                                                                                                                          ^
Mercury/javas/jmercury/bit_access_uint16.java:34: error: package jmercury.runtime does not exist 
  private static final jmercury.runtime.TypeInfo_Struct __vpti_tuple_1__plain_builtin__type_ctor_info_uint16_0 = new jmercury.runtime.TypeInfo_Struct();
                                                                                                                                     ^
Mercury/javas/jmercury/bit_access_uint16.java:35: error: package jmercury.runtime does not exist 
  private static final jmercury.runtime.TypeInfo_Struct __vpti_tuple_0 = new jmercury.runtime.TypeInfo_Struct();
                                                                                             ^
Mercury/javas/jmercury/bit_access_uint16.java:40: error: cannot find symbol 
      builtin.builtin__type_ctor_info_func_0,
      ^
  symbol:   variable builtin
  location: class bit_access_uint16
Mercury/javas/jmercury/bit_access_uint16.java:42: error: package jmercury.runtime does not exist 
        (jmercury.runtime.PseudoTypeInfo) builtin.builtin__type_ctor_info_uint16_0,
                         ^
Mercury/javas/jmercury/bit_access_uint16.java:42: error: cannot find symbol 
        (jmercury.runtime.PseudoTypeInfo) builtin.builtin__type_ctor_info_uint16_0,
                                          ^
  symbol:   variable builtin
  location: class bit_access_uint16
Mercury/javas/jmercury/bit_access_uint16.java:43: error: package jmercury.runtime does not exist 
        (jmercury.runtime.PseudoTypeInfo) builtin.builtin__type_ctor_info_uint_0,
                         ^
Mercury/javas/jmercury/bit_access_uint16.java:43: error: cannot find symbol 
        (jmercury.runtime.PseudoTypeInfo) builtin.builtin__type_ctor_info_uint_0,
                                          ^
  symbol:   variable builtin
  location: class bit_access_uint16
Mercury/javas/jmercury/bit_access_uint16.java:44: error: package jmercury.runtime does not exist 
        (jmercury.runtime.PseudoTypeInfo) builtin.builtin__type_ctor_info_uint16_0
                         ^
Mercury/javas/jmercury/bit_access_uint16.java:44: error: cannot find symbol 
        (jmercury.runtime.PseudoTypeInfo) builtin.builtin__type_ctor_info_uint16_0
                                          ^
  symbol:   variable builtin
  location: class bit_access_uint16
Mercury/javas/jmercury/bit_access_uint16.java:48: error: cannot find symbol 
      builtin.builtin__type_ctor_info_pred_0,
      ^
  symbol:   variable builtin
  location: class bit_access_uint16
Mercury/javas/jmercury/bit_access_uint16.java:50: error: package jmercury.runtime does not exist 
        (jmercury.runtime.PseudoTypeInfo) builtin.builtin__type_ctor_info_uint16_0,
                         ^
Mercury/javas/jmercury/bit_access_uint16.java:50: error: cannot find symbol 
        (jmercury.runtime.PseudoTypeInfo) builtin.builtin__type_ctor_info_uint16_0,
                                          ^
  symbol:   variable builtin
  location: class bit_access_uint16
Mercury/javas/jmercury/bit_access_uint16.java:51: error: package jmercury.runtime does not exist 
        (jmercury.runtime.PseudoTypeInfo) builtin.builtin__type_ctor_info_uint_0
                         ^
Mercury/javas/jmercury/bit_access_uint16.java:51: error: cannot find symbol 
        (jmercury.runtime.PseudoTypeInfo) builtin.builtin__type_ctor_info_uint_0
                                          ^
  symbol:   variable builtin
  location: class bit_access_uint16
Mercury/javas/jmercury/bit_access_uint16.java:55: error: cannot find symbol 
      builtin.builtin__type_ctor_info_tuple_0,
      ^
  symbol:   variable builtin
  location: class bit_access_uint16
Mercury/javas/jmercury/bit_access_uint16.java:57: error: package jmercury.runtime does not exist 
        (jmercury.runtime.PseudoTypeInfo) builtin.builtin__type_ctor_info_uint16_0
                         ^
Mercury/javas/jmercury/bit_access_uint16.java:57: error: cannot find symbol 
        (jmercury.runtime.PseudoTypeInfo) builtin.builtin__type_ctor_info_uint16_0
                                          ^
  symbol:   variable builtin
  location: class bit_access_uint16
Mercury/javas/jmercury/bit_access_uint16.java:61: error: cannot find symbol 
      builtin.builtin__type_ctor_info_tuple_0,
      ^
  symbol:   variable builtin
  location: class bit_access_uint16
Mercury/javas/jmercury/bit_access_uint16.java:71: error: package jmercury.runtime does not exist 
  private static final jmercury.runtime.TypeInfo_Struct[] MR_scalar_common_1 = new jmercury.runtime.TypeInfo_Struct[1];
                                                                                                   ^
Mercury/javas/jmercury/bit_access_uint16.java:73: error: package list.List_1 does not exist 
  private static final list.List_1.F_nil_0[] MR_scalar_common_3 = new list.List_1.F_nil_0[1];
                                                                                 ^
Mercury/javas/jmercury/bit_access_uint16.java:74: error: package list.List_1 does not exist 
  private static final list.List_1.F_cons_2[] MR_scalar_common_4 = new list.List_1.F_cons_2[13];
                                                                                  ^
Mercury/javas/jmercury/bit_access_uint16.java:80: error: package string__parse_util does not exist 
  private static final string__parse_util.String_format_flags_0[] MR_scalar_common_10 = new string__parse_util.String_format_flags_0[1];
                                                                                                              ^
Mercury/javas/jmercury/bit_access_uint16.java:85: error: package jmercury.runtime does not exist 
      new jmercury.runtime.TypeInfo_Struct(
                          ^
Mercury/javas/jmercury/bit_access_uint16.java:86: error: cannot find symbol 
        ((java.lang.Object) (jmercury.runtime.TypeInfo_Struct.maybe_new(builtin.builtin__type_ctor_info_tuple_0))),
                                                                        ^
  symbol:   variable builtin
  location: class bit_access_uint16
Mercury/javas/jmercury/bit_access_uint16.java:86: error: package jmercury.runtime does not exist 
        ((java.lang.Object) (jmercury.runtime.TypeInfo_Struct.maybe_new(builtin.builtin__type_ctor_info_tuple_0))),
                                             ^
Mercury/javas/jmercury/bit_access_uint16.java:87: error: cannot find symbol 
        ((java.lang.Object) (jmercury.runtime.TypeInfo_Struct.maybe_new(builtin.builtin__type_ctor_info_uint16_0)))
                                                                        ^
  symbol:   variable builtin
  location: class bit_access_uint16
Mercury/javas/jmercury/bit_access_uint16.java:87: error: package jmercury.runtime does not exist 
        ((java.lang.Object) (jmercury.runtime.TypeInfo_Struct.maybe_new(builtin.builtin__type_ctor_info_uint16_0)))
                                             ^
Mercury/javas/jmercury/bit_access_uint16.java:95: error: cannot find symbol 
        ((java.lang.Object) (builtin.builtin__type_ctor_info_string_0)),
                             ^
  symbol:   variable builtin
  location: class bit_access_uint16
Mercury/javas/jmercury/bit_access_uint16.java:95: error: illegal start of type 
        ((java.lang.Object) (builtin.builtin__type_ctor_info_string_0)),
                            ^
Mercury/javas/jmercury/bit_access_uint16.java:96: error: cannot find symbol 
        ((java.lang.Object) (builtin.builtin__type_ctor_info_uint16_0)),
                             ^
  symbol:   variable builtin
  location: class bit_access_uint16
Mercury/javas/jmercury/bit_access_uint16.java:96: error: illegal start of type 
        ((java.lang.Object) (builtin.builtin__type_ctor_info_uint16_0)),
                            ^
Mercury/javas/jmercury/bit_access_uint16.java:97: error: cannot find symbol 
        ((java.lang.Object) (io.io__type_ctor_info_state_0)),
                             ^
  symbol:   variable io
  location: class bit_access_uint16
Mercury/javas/jmercury/bit_access_uint16.java:97: error: illegal start of type 
        ((java.lang.Object) (io.io__type_ctor_info_state_0)),
                            ^
Mercury/javas/jmercury/bit_access_uint16.java:98: error: cannot find symbol 
        ((java.lang.Object) (io.io__type_ctor_info_state_0))
                             ^
  symbol:   variable io
  location: class bit_access_uint16
Mercury/javas/jmercury/bit_access_uint16.java:98: error: illegal start of type 
        ((java.lang.Object) (io.io__type_ctor_info_state_0))
                            ^
Mercury/javas/jmercury/bit_access_uint16.java:106: error: cannot find symbol 
        ((java.lang.Object) (builtin.builtin__type_ctor_info_string_0)),
                             ^
  symbol:   variable builtin
  location: class bit_access_uint16
Mercury/javas/jmercury/bit_access_uint16.java:106: error: illegal start of type 
        ((java.lang.Object) (builtin.builtin__type_ctor_info_string_0)),
                            ^
Mercury/javas/jmercury/bit_access_uint16.java:107: error: cannot find symbol 
        ((java.lang.Object) (builtin.builtin__type_ctor_info_uint16_0)),
                             ^
  symbol:   variable builtin
  location: class bit_access_uint16
Mercury/javas/jmercury/bit_access_uint16.java:107: error: illegal start of type 
        ((java.lang.Object) (builtin.builtin__type_ctor_info_uint16_0)),
                            ^
Mercury/javas/jmercury/bit_access_uint16.java:108: error: cannot find symbol 
        ((java.lang.Object) (io.io__type_ctor_info_state_0)),
                             ^
  symbol:   variable io
  location: class bit_access_uint16
Mercury/javas/jmercury/bit_access_uint16.java:108: error: illegal start of type 
        ((java.lang.Object) (io.io__type_ctor_info_state_0)),
                            ^
Mercury/javas/jmercury/bit_access_uint16.java:109: error: cannot find symbol 
        ((java.lang.Object) (io.io__type_ctor_info_state_0))
                             ^
  symbol:   variable io
  location: class bit_access_uint16
Mercury/javas/jmercury/bit_access_uint16.java:109: error: illegal start of type 
        ((java.lang.Object) (io.io__type_ctor_info_state_0))
                            ^
Mercury/javas/jmercury/bit_access_uint16.java:112: error: package list.List_1 does not exist 
      new list.List_1.F_nil_0();
                     ^
Mercury/javas/jmercury/bit_access_uint16.java:114: error: package list.List_1 does not exist 
      new list.List_1.F_cons_2(
                     ^
Mercury/javas/jmercury/bit_access_uint16.java:116: error: package list does not exist 
        (list.List_1) bit_access_uint16.MR_scalar_common_3[0]
             ^
Mercury/javas/jmercury/bit_access_uint16.java:119: error: package list.List_1 does not exist 
      new list.List_1.F_cons_2(
                     ^
Mercury/javas/jmercury/bit_access_uint16.java:121: error: package list does not exist 
        (list.List_1) bit_access_uint16.MR_scalar_common_4[0]
             ^
Mercury/javas/jmercury/bit_access_uint16.java:124: error: package list.List_1 does not exist 
      new list.List_1.F_cons_2(
                     ^
Mercury/javas/jmercury/bit_access_uint16.java:126: error: package list does not exist 
        (list.List_1) bit_access_uint16.MR_scalar_common_4[0]
             ^
Mercury/javas/jmercury/bit_access_uint16.java:129: error: package list.List_1 does not exist 
      new list.List_1.F_cons_2(
                     ^
Mercury/javas/jmercury/bit_access_uint16.java:131: error: package list does not exist 
        (list.List_1) bit_access_uint16.MR_scalar_common_4[2]
             ^
Mercury/javas/jmercury/bit_access_uint16.java:134: error: package list.List_1 does not exist 
      new list.List_1.F_cons_2(
                     ^
Mercury/javas/jmercury/bit_access_uint16.java:136: error: package list does not exist 
        (list.List_1) bit_access_uint16.MR_scalar_common_4[3]
             ^
Mercury/javas/jmercury/bit_access_uint16.java:139: error: package list.List_1 does not exist 
      new list.List_1.F_cons_2(
                     ^
Mercury/javas/jmercury/bit_access_uint16.java:141: error: package list does not exist 
        (list.List_1) bit_access_uint16.MR_scalar_common_4[4]
             ^
Mercury/javas/jmercury/bit_access_uint16.java:144: error: package list.List_1 does not exist 
      new list.List_1.F_cons_2(
                     ^
Mercury/javas/jmercury/bit_access_uint16.java:146: error: package list does not exist 
        (list.List_1) bit_access_uint16.MR_scalar_common_4[5]
             ^
Mercury/javas/jmercury/bit_access_uint16.java:149: error: package list.List_1 does not exist 
      new list.List_1.F_cons_2(
                     ^
Mercury/javas/jmercury/bit_access_uint16.java:151: error: package list does not exist 
        (list.List_1) bit_access_uint16.MR_scalar_common_3[0]
             ^
Mercury/javas/jmercury/bit_access_uint16.java:154: error: package list.List_1 does not exist 
      new list.List_1.F_cons_2(
                     ^
Mercury/javas/jmercury/bit_access_uint16.java:156: error: package list does not exist 
        (list.List_1) bit_access_uint16.MR_scalar_common_4[7]
             ^
Mercury/javas/jmercury/bit_access_uint16.java:159: error: package list.List_1 does not exist 
      new list.List_1.F_cons_2(
                     ^
Mercury/javas/jmercury/bit_access_uint16.java:161: error: package list does not exist 
        (list.List_1) bit_access_uint16.MR_scalar_common_4[8]
             ^
Mercury/javas/jmercury/bit_access_uint16.java:164: error: package list.List_1 does not exist 
      new list.List_1.F_cons_2(
                     ^
Mercury/javas/jmercury/bit_access_uint16.java:166: error: package list does not exist 
        (list.List_1) bit_access_uint16.MR_scalar_common_4[9]
             ^
Mercury/javas/jmercury/bit_access_uint16.java:169: error: package list.List_1 does not exist 
      new list.List_1.F_cons_2(
                     ^
Mercury/javas/jmercury/bit_access_uint16.java:171: error: package list does not exist 
        (list.List_1) bit_access_uint16.MR_scalar_common_4[10]
             ^
Mercury/javas/jmercury/bit_access_uint16.java:174: error: package list.List_1 does not exist 
      new list.List_1.F_cons_2(
                     ^
Mercury/javas/jmercury/bit_access_uint16.java:176: error: package list does not exist 
        (list.List_1) bit_access_uint16.MR_scalar_common_4[11]
             ^
Mercury/javas/jmercury/bit_access_uint16.java:183: error: cannot find symbol 
        ((java.lang.Object) (builtin.builtin__type_ctor_info_uint16_0)),
                             ^
  symbol:   variable builtin
  location: class bit_access_uint16
Mercury/javas/jmercury/bit_access_uint16.java:183: error: illegal start of type 
        ((java.lang.Object) (builtin.builtin__type_ctor_info_uint16_0)),
                            ^
Mercury/javas/jmercury/bit_access_uint16.java:184: error: cannot find symbol 
        ((java.lang.Object) (builtin.builtin__type_ctor_info_uint_0)),
                             ^
  symbol:   variable builtin
  location: class bit_access_uint16
Mercury/javas/jmercury/bit_access_uint16.java:184: error: illegal start of type 
        ((java.lang.Object) (builtin.builtin__type_ctor_info_uint_0)),
                            ^
Mercury/javas/jmercury/bit_access_uint16.java:185: error: cannot find symbol 
        ((java.lang.Object) (builtin.builtin__type_ctor_info_uint16_0))
                             ^
  symbol:   variable builtin
  location: class bit_access_uint16
Mercury/javas/jmercury/bit_access_uint16.java:185: error: illegal start of type 
        ((java.lang.Object) (builtin.builtin__type_ctor_info_uint16_0))
                            ^
Mercury/javas/jmercury/bit_access_uint16.java:210: error: cannot find symbol 
        ((java.lang.Object) (builtin.builtin__type_ctor_info_uint16_0)),
                             ^
  symbol:   variable builtin
  location: class bit_access_uint16
100 errors
gmake[3]: *** [/tmp/mmake.HKPMXb:2362: bit_access_uint16] Error 1
gmake[3]: Target 'bit_access_uint16.runtest' not remade because of errors.
gmake[3]: Leaving directory '/home/mercury/testing/run/build/mercury-srcdist-rotd-2025-03-30/tests/hard_coded'