hlc.par.gc

Bootcheck terminated with exit status 1 (log)

/usr/lib/gcc-cross/i686-linux-gnu/13/../../../../i686-linux-gnu/bin/ld: warning: atomic_ops_sysdeps.o: missing .note.GNU-stack section implies executable stack
FAILED TEST feedback/autopar_mandelbrot-nodepend in grade hlc.par.gc
FAILED TEST feedback/autopar_mmc-nodepend in grade hlc.par.gc
FAILED TEST warnings/table_with_inline in grade hlc.par.gc
ERROR EXIT: unexpected change in tests/debugger/mdb_command_test.inp
ERROR EXIT: some tests failed
ERROR EXIT: some namespace isn't clean

Duration: 0.49 hours