MERCURY_OPTIONS=
gmake[3]: Entering directory '/home/mercury/testing/run/build/mercury-srcdist-rotd-2025-03-28/tests/hard_coded'
{ echo MCFLAGS += '--grade java    --options-file /home/mercury/testing/run/build/mercury-srcdist-rotd-2025-03-28/stage2/Mercury.options --mercury-linkage static -j2 --flags ../TESTS_FLAGS --flags ../WS_FLAGS --use-subdirs    '; echo MCFLAGS += ' '; echo CFLAGS += '    '; echo JAVACFLAGS += '-J"-Xmx1024m"   '; echo CSCFLAGS += '   '; echo C2INITARGS += '/home/mercury/testing/run/build/mercury-srcdist-rotd-2025-03-28/stage2/library/mer_std.init /home/mercury/testing/run/build/mercury-srcdist-rotd-2025-03-28/stage2/runtime/mer_rt.init    '; echo MLLIBS += '   '; echo MLOBJS += '  '; echo LDFLAGS += '  '; echo LD_LIBFLAGS += '  '; echo EXTRA_LIBRARIES += ''; echo EXTRA_LIB_DIRS += ''; echo LIBGRADES = 'hlc.gc  '; echo INSTALL_PREFIX = '/home/mercury/testing/run/install'; echo LINKAGE = 'shared'; echo MERCURY_LINKAGE = 'shared'; } | /home/mercury/testing/run/build/mercury-srcdist-rotd-2025-03-28/stage2/scripts/mmc --make --options-file - qual_is_test.depend
gmake[3]: Leaving directory '/home/mercury/testing/run/build/mercury-srcdist-rotd-2025-03-28/tests/hard_coded'
gmake[3]: Entering directory '/home/mercury/testing/run/build/mercury-srcdist-rotd-2025-03-28/tests/hard_coded'
{ echo MCFLAGS += '--grade java    --options-file /home/mercury/testing/run/build/mercury-srcdist-rotd-2025-03-28/stage2/Mercury.options --mercury-linkage static -j2 --flags ../TESTS_FLAGS --flags ../WS_FLAGS --use-subdirs    '; echo MCFLAGS += ' '; echo CFLAGS += '    '; echo JAVACFLAGS += '-J"-Xmx1024m"   '; echo CSCFLAGS += '   '; echo C2INITARGS += '/home/mercury/testing/run/build/mercury-srcdist-rotd-2025-03-28/stage2/library/mer_std.init /home/mercury/testing/run/build/mercury-srcdist-rotd-2025-03-28/stage2/runtime/mer_rt.init    '; echo MLLIBS += '   '; echo MLOBJS += '  '; echo LDFLAGS += '  '; echo LD_LIBFLAGS += '  '; echo EXTRA_LIBRARIES += ''; echo EXTRA_LIB_DIRS += ''; echo LIBGRADES = 'hlc.gc  '; echo INSTALL_PREFIX = '/home/mercury/testing/run/install'; echo LINKAGE = 'shared'; echo MERCURY_LINKAGE = 'shared'; } | /home/mercury/testing/run/build/mercury-srcdist-rotd-2025-03-28/stage2/scripts/mmc --make --options-file - qual_is_test
Making Mercury/int3s/qual_is_test.int3
Making Mercury/int3s/qual_is_test_helper_1.int3
Making Mercury/ints/qual_is_test_helper_1.int
Making Mercury/ints/qual_is_test.int
Making Mercury/javas/jmercury/qual_is_test.java
Making Mercury/javas/jmercury/qual_is_test_helper_1.java
Making Java class files
Mercury/javas/jmercury/qual_is_test.java:15: error: package jmercury.runtime does not exist 
    jmercury.runtime.JavaInternal.progname = "qual_is_test";
                    ^
Mercury/javas/jmercury/qual_is_test.java:16: error: package jmercury.runtime does not exist 
    jmercury.runtime.JavaInternal.args = args;
                    ^
Mercury/javas/jmercury/qual_is_test.java:17: error: package jmercury.runtime does not exist 
    jmercury.runtime.JavaInternal.exit_status = 0;
                    ^
Mercury/javas/jmercury/qual_is_test.java:18: error: cannot find symbol 
    library.ML_std_library_init();
    ^
  symbol:   variable library
  location: class qual_is_test
Mercury/javas/jmercury/qual_is_test.java:19: error: cannot find symbol 
    benchmarking.ML_initialise();
    ^
  symbol:   variable benchmarking
  location: class qual_is_test
Mercury/javas/jmercury/qual_is_test.java:25: error: package jmercury.runtime does not exist 
    jmercury.runtime.JavaInternal.runMain(run_main);
                    ^
Mercury/javas/jmercury/qual_is_test.java:26: error: cannot find symbol 
    io.flush_output_3_p_0(io.stdout_stream_0_f_0());
                          ^
  symbol:   variable io
  location: class qual_is_test
Mercury/javas/jmercury/qual_is_test.java:26: error: cannot find symbol 
    io.flush_output_3_p_0(io.stdout_stream_0_f_0());
    ^
  symbol:   variable io
  location: class qual_is_test
Mercury/javas/jmercury/qual_is_test.java:27: error: cannot find symbol 
    io.flush_output_3_p_0(io.stderr_stream_0_f_0());
                          ^
  symbol:   variable io
  location: class qual_is_test
Mercury/javas/jmercury/qual_is_test.java:27: error: cannot find symbol 
    io.flush_output_3_p_0(io.stderr_stream_0_f_0());
    ^
  symbol:   variable io
  location: class qual_is_test
Mercury/javas/jmercury/qual_is_test.java:28: error: package jmercury.runtime does not exist 
    java.lang.System.exit(jmercury.runtime.JavaInternal.exit_status);
                                          ^
Mercury/javas/jmercury/qual_is_test.java:43: error: cannot find symbol 
      io.write_string_3_p_0(W_4);
      ^
  symbol:   variable io
  location: class qual_is_test
12 errors
gmake[3]: *** [/tmp/mmake.JbJAmj:2362: qual_is_test] Error 1
gmake[3]: Target 'qual_is_test.runtest' not remade because of errors.
gmake[3]: Leaving directory '/home/mercury/testing/run/build/mercury-srcdist-rotd-2025-03-28/tests/hard_coded'