MERCURY_OPTIONS=
gmake[3]: Entering directory '/home/mercury/testing/run/build/mercury-srcdist-rotd-2025-03-28/tests/valid'
{ echo MCFLAGS += '--grade java    --options-file /home/mercury/testing/run/build/mercury-srcdist-rotd-2025-03-28/stage2/Mercury.options --mercury-linkage static -j2 --flags ../TESTS_FLAGS --flags ../WS_FLAGS --use-subdirs    '; echo MCFLAGS += ' '; echo CFLAGS += '    '; echo JAVACFLAGS += '-J"-Xmx1024m"   '; echo CSCFLAGS += '   '; echo C2INITARGS += '/home/mercury/testing/run/build/mercury-srcdist-rotd-2025-03-28/stage2/library/mer_std.init /home/mercury/testing/run/build/mercury-srcdist-rotd-2025-03-28/stage2/runtime/mer_rt.init    '; echo MLLIBS += '   '; echo MLOBJS += '  '; echo LDFLAGS += '  '; echo LD_LIBFLAGS += '  '; echo EXTRA_LIBRARIES += ''; echo EXTRA_LIB_DIRS += ''; echo LIBGRADES = 'hlc.gc  '; echo INSTALL_PREFIX = '/home/mercury/testing/run/install'; echo LINKAGE = 'shared'; echo MERCURY_LINKAGE = 'shared'; } | /home/mercury/testing/run/build/mercury-srcdist-rotd-2025-03-28/stage2/scripts/mmc --make --options-file - indexing.depend
gmake[3]: Leaving directory '/home/mercury/testing/run/build/mercury-srcdist-rotd-2025-03-28/tests/valid'
gmake[3]: Entering directory '/home/mercury/testing/run/build/mercury-srcdist-rotd-2025-03-28/tests/valid'
{ echo MCFLAGS += '--grade java    --options-file /home/mercury/testing/run/build/mercury-srcdist-rotd-2025-03-28/stage2/Mercury.options --mercury-linkage static -j2 --flags ../TESTS_FLAGS --flags ../WS_FLAGS --use-subdirs    '; echo MCFLAGS += ' '; echo CFLAGS += '    '; echo JAVACFLAGS += '-J"-Xmx1024m"   '; echo CSCFLAGS += '   '; echo C2INITARGS += '/home/mercury/testing/run/build/mercury-srcdist-rotd-2025-03-28/stage2/library/mer_std.init /home/mercury/testing/run/build/mercury-srcdist-rotd-2025-03-28/stage2/runtime/mer_rt.init    '; echo MLLIBS += '   '; echo MLOBJS += '  '; echo LDFLAGS += '  '; echo LD_LIBFLAGS += '  '; echo EXTRA_LIBRARIES += ''; echo EXTRA_LIB_DIRS += ''; echo LIBGRADES = 'hlc.gc  '; echo INSTALL_PREFIX = '/home/mercury/testing/run/install'; echo LINKAGE = 'shared'; echo MERCURY_LINKAGE = 'shared'; } | /home/mercury/testing/run/build/mercury-srcdist-rotd-2025-03-28/stage2/scripts/mmc --make --options-file - indexing.class
Making Mercury/int3s/indexing.int3
Making Mercury/ints/indexing.int
Making Mercury/javas/jmercury/indexing.java
Making Mercury/classes/jmercury/indexing.class
Mercury/javas/jmercury/indexing.java:15: error: package jmercury.runtime does not exist 
  private static final jmercury.runtime.EnumFunctorDesc indexing__enum_functor_desc_t32_0_0 = new jmercury.runtime.EnumFunctorDesc();
                                       ^
Mercury/javas/jmercury/indexing.java:16: error: package jmercury.runtime does not exist 
  private static final jmercury.runtime.EnumFunctorDesc indexing__enum_functor_desc_t32_0_1 = new jmercury.runtime.EnumFunctorDesc();
                                       ^
Mercury/javas/jmercury/indexing.java:17: error: package jmercury.runtime does not exist 
  private static final jmercury.runtime.EnumFunctorDesc indexing__enum_functor_desc_t32_0_2 = new jmercury.runtime.EnumFunctorDesc();
                                       ^
Mercury/javas/jmercury/indexing.java:18: error: package jmercury.runtime does not exist 
  private static final jmercury.runtime.EnumFunctorDesc indexing__enum_functor_desc_t32_0_3 = new jmercury.runtime.EnumFunctorDesc();
                                       ^
Mercury/javas/jmercury/indexing.java:19: error: package jmercury.runtime does not exist 
  private static final jmercury.runtime.EnumFunctorDesc indexing__enum_functor_desc_t32_0_4 = new jmercury.runtime.EnumFunctorDesc();
                                       ^
Mercury/javas/jmercury/indexing.java:20: error: package jmercury.runtime does not exist 
  private static final jmercury.runtime.EnumFunctorDesc indexing__enum_functor_desc_t32_0_5 = new jmercury.runtime.EnumFunctorDesc();
                                       ^
Mercury/javas/jmercury/indexing.java:21: error: package jmercury.runtime does not exist 
  private static final jmercury.runtime.EnumFunctorDesc indexing__enum_functor_desc_t32_0_6 = new jmercury.runtime.EnumFunctorDesc();
                                       ^
Mercury/javas/jmercury/indexing.java:22: error: package jmercury.runtime does not exist 
  private static final jmercury.runtime.EnumFunctorDesc indexing__enum_functor_desc_t32_0_7 = new jmercury.runtime.EnumFunctorDesc();
                                       ^
Mercury/javas/jmercury/indexing.java:23: error: package jmercury.runtime does not exist 
  private static final jmercury.runtime.EnumFunctorDesc indexing__enum_functor_desc_t32_0_8 = new jmercury.runtime.EnumFunctorDesc();
                                       ^
Mercury/javas/jmercury/indexing.java:24: error: package jmercury.runtime does not exist 
  private static final jmercury.runtime.EnumFunctorDesc indexing__enum_functor_desc_t32_0_9 = new jmercury.runtime.EnumFunctorDesc();
                                       ^
Mercury/javas/jmercury/indexing.java:25: error: package jmercury.runtime does not exist 
  private static final jmercury.runtime.EnumFunctorDesc indexing__enum_functor_desc_t32_0_10 = new jmercury.runtime.EnumFunctorDesc();
                                       ^
Mercury/javas/jmercury/indexing.java:26: error: package jmercury.runtime does not exist 
  private static final jmercury.runtime.EnumFunctorDesc indexing__enum_functor_desc_t32_0_11 = new jmercury.runtime.EnumFunctorDesc();
                                       ^
Mercury/javas/jmercury/indexing.java:27: error: package jmercury.runtime does not exist 
  private static final jmercury.runtime.EnumFunctorDesc indexing__enum_functor_desc_t32_0_12 = new jmercury.runtime.EnumFunctorDesc();
                                       ^
Mercury/javas/jmercury/indexing.java:28: error: package jmercury.runtime does not exist 
  private static final jmercury.runtime.EnumFunctorDesc indexing__enum_functor_desc_t32_0_13 = new jmercury.runtime.EnumFunctorDesc();
                                       ^
Mercury/javas/jmercury/indexing.java:29: error: package jmercury.runtime does not exist 
  private static final jmercury.runtime.EnumFunctorDesc indexing__enum_functor_desc_t32_0_14 = new jmercury.runtime.EnumFunctorDesc();
                                       ^
Mercury/javas/jmercury/indexing.java:30: error: package jmercury.runtime does not exist 
  private static final jmercury.runtime.EnumFunctorDesc indexing__enum_functor_desc_t32_0_15 = new jmercury.runtime.EnumFunctorDesc();
                                       ^
Mercury/javas/jmercury/indexing.java:31: error: package jmercury.runtime does not exist 
  private static final jmercury.runtime.EnumFunctorDesc indexing__enum_functor_desc_t32_0_16 = new jmercury.runtime.EnumFunctorDesc();
                                       ^
Mercury/javas/jmercury/indexing.java:32: error: package jmercury.runtime does not exist 
  private static final jmercury.runtime.EnumFunctorDesc indexing__enum_functor_desc_t32_0_17 = new jmercury.runtime.EnumFunctorDesc();
                                       ^
Mercury/javas/jmercury/indexing.java:33: error: package jmercury.runtime does not exist 
  private static final jmercury.runtime.EnumFunctorDesc indexing__enum_functor_desc_t32_0_18 = new jmercury.runtime.EnumFunctorDesc();
                                       ^
Mercury/javas/jmercury/indexing.java:34: error: package jmercury.runtime does not exist 
  private static final jmercury.runtime.EnumFunctorDesc indexing__enum_functor_desc_t32_0_19 = new jmercury.runtime.EnumFunctorDesc();
                                       ^
Mercury/javas/jmercury/indexing.java:35: error: package jmercury.runtime does not exist 
  private static final jmercury.runtime.EnumFunctorDesc indexing__enum_functor_desc_t32_0_20 = new jmercury.runtime.EnumFunctorDesc();
                                       ^
Mercury/javas/jmercury/indexing.java:36: error: package jmercury.runtime does not exist 
  private static final jmercury.runtime.EnumFunctorDesc indexing__enum_functor_desc_t32_0_21 = new jmercury.runtime.EnumFunctorDesc();
                                       ^
Mercury/javas/jmercury/indexing.java:37: error: package jmercury.runtime does not exist 
  private static final jmercury.runtime.EnumFunctorDesc indexing__enum_functor_desc_t32_0_22 = new jmercury.runtime.EnumFunctorDesc();
                                       ^
Mercury/javas/jmercury/indexing.java:38: error: package jmercury.runtime does not exist 
  private static final jmercury.runtime.EnumFunctorDesc indexing__enum_functor_desc_t32_0_23 = new jmercury.runtime.EnumFunctorDesc();
                                       ^
Mercury/javas/jmercury/indexing.java:39: error: package jmercury.runtime does not exist 
  private static final jmercury.runtime.EnumFunctorDesc indexing__enum_functor_desc_t32_0_24 = new jmercury.runtime.EnumFunctorDesc();
                                       ^
Mercury/javas/jmercury/indexing.java:40: error: package jmercury.runtime does not exist 
  private static final jmercury.runtime.EnumFunctorDesc indexing__enum_functor_desc_t32_0_25 = new jmercury.runtime.EnumFunctorDesc();
                                       ^
Mercury/javas/jmercury/indexing.java:41: error: package jmercury.runtime does not exist 
  private static final jmercury.runtime.EnumFunctorDesc indexing__enum_functor_desc_t32_0_26 = new jmercury.runtime.EnumFunctorDesc();
                                       ^
Mercury/javas/jmercury/indexing.java:42: error: package jmercury.runtime does not exist 
  private static final jmercury.runtime.EnumFunctorDesc indexing__enum_functor_desc_t32_0_27 = new jmercury.runtime.EnumFunctorDesc();
                                       ^
Mercury/javas/jmercury/indexing.java:43: error: package jmercury.runtime does not exist 
  private static final jmercury.runtime.EnumFunctorDesc indexing__enum_functor_desc_t32_0_28 = new jmercury.runtime.EnumFunctorDesc();
                                       ^
Mercury/javas/jmercury/indexing.java:44: error: package jmercury.runtime does not exist 
  private static final jmercury.runtime.EnumFunctorDesc indexing__enum_functor_desc_t32_0_29 = new jmercury.runtime.EnumFunctorDesc();
                                       ^
Mercury/javas/jmercury/indexing.java:45: error: package jmercury.runtime does not exist 
  private static final jmercury.runtime.EnumFunctorDesc indexing__enum_functor_desc_t32_0_30 = new jmercury.runtime.EnumFunctorDesc();
                                       ^
Mercury/javas/jmercury/indexing.java:46: error: package jmercury.runtime does not exist 
  private static final jmercury.runtime.EnumFunctorDesc indexing__enum_functor_desc_t32_0_31 = new jmercury.runtime.EnumFunctorDesc();
                                       ^
Mercury/javas/jmercury/indexing.java:47: error: package jmercury.runtime does not exist 
  private static final jmercury.runtime.EnumFunctorDesc[] indexing__enum_ordinal_ordered_t32_0 = new jmercury.runtime.EnumFunctorDesc[32];
                                       ^
Mercury/javas/jmercury/indexing.java:48: error: package jmercury.runtime does not exist 
  private static final jmercury.runtime.EnumFunctorDesc[] indexing__enum_name_ordered_t32_0 = new jmercury.runtime.EnumFunctorDesc[32];
                                       ^
Mercury/javas/jmercury/indexing.java:50: error: package jmercury.runtime does not exist 
  public static final jmercury.runtime.TypeCtorInfo_Struct indexing__type_ctor_info_t32_0 = new jmercury.runtime.TypeCtorInfo_Struct();
                                      ^
Mercury/javas/jmercury/indexing.java:51: error: package jmercury.runtime does not exist 
  private static final jmercury.runtime.EnumFunctorDesc indexing__enum_functor_desc_t5_0_0 = new jmercury.runtime.EnumFunctorDesc();
                                       ^
Mercury/javas/jmercury/indexing.java:52: error: package jmercury.runtime does not exist 
  private static final jmercury.runtime.EnumFunctorDesc indexing__enum_functor_desc_t5_0_1 = new jmercury.runtime.EnumFunctorDesc();
                                       ^
Mercury/javas/jmercury/indexing.java:53: error: package jmercury.runtime does not exist 
  private static final jmercury.runtime.EnumFunctorDesc indexing__enum_functor_desc_t5_0_2 = new jmercury.runtime.EnumFunctorDesc();
                                       ^
Mercury/javas/jmercury/indexing.java:54: error: package jmercury.runtime does not exist 
  private static final jmercury.runtime.EnumFunctorDesc indexing__enum_functor_desc_t5_0_3 = new jmercury.runtime.EnumFunctorDesc();
                                       ^
Mercury/javas/jmercury/indexing.java:55: error: package jmercury.runtime does not exist 
  private static final jmercury.runtime.EnumFunctorDesc indexing__enum_functor_desc_t5_0_4 = new jmercury.runtime.EnumFunctorDesc();
                                       ^
Mercury/javas/jmercury/indexing.java:56: error: package jmercury.runtime does not exist 
  private static final jmercury.runtime.EnumFunctorDesc[] indexing__enum_ordinal_ordered_t5_0 = new jmercury.runtime.EnumFunctorDesc[5];
                                       ^
Mercury/javas/jmercury/indexing.java:57: error: package jmercury.runtime does not exist 
  private static final jmercury.runtime.EnumFunctorDesc[] indexing__enum_name_ordered_t5_0 = new jmercury.runtime.EnumFunctorDesc[5];
                                       ^
Mercury/javas/jmercury/indexing.java:59: error: package jmercury.runtime does not exist 
  public static final jmercury.runtime.TypeCtorInfo_Struct indexing__type_ctor_info_t5_0 = new jmercury.runtime.TypeCtorInfo_Struct();
                                      ^
Mercury/javas/jmercury/indexing.java:838: error: package jmercury.runtime does not exist 
    extends jmercury.runtime.MercuryEnum
                            ^
Mercury/javas/jmercury/indexing.java:839: error: package jmercury.runtime does not exist 
  implements jmercury.runtime.MercuryType
                             ^
Mercury/javas/jmercury/indexing.java:796: error: package jmercury.runtime does not exist 
    extends jmercury.runtime.MercuryEnum
                            ^
Mercury/javas/jmercury/indexing.java:797: error: package jmercury.runtime does not exist 
  implements jmercury.runtime.MercuryType
                             ^
Mercury/javas/jmercury/indexing.java:608: error: package builtin does not exist 
  public static builtin.Comparison_result_0
                       ^
Mercury/javas/jmercury/indexing.java:647: error: package builtin does not exist 
  public static builtin.Comparison_result_0
                       ^
Mercury/javas/jmercury/indexing.java:734: error: package jmercury.runtime does not exist 
    implements jmercury.runtime.MethodPtr2
                               ^
Mercury/javas/jmercury/indexing.java:15: error: package jmercury.runtime does not exist 
  private static final jmercury.runtime.EnumFunctorDesc indexing__enum_functor_desc_t32_0_0 = new jmercury.runtime.EnumFunctorDesc();
                                                                                                                  ^
Mercury/javas/jmercury/indexing.java:16: error: package jmercury.runtime does not exist 
  private static final jmercury.runtime.EnumFunctorDesc indexing__enum_functor_desc_t32_0_1 = new jmercury.runtime.EnumFunctorDesc();
                                                                                                                  ^
Mercury/javas/jmercury/indexing.java:17: error: package jmercury.runtime does not exist 
  private static final jmercury.runtime.EnumFunctorDesc indexing__enum_functor_desc_t32_0_2 = new jmercury.runtime.EnumFunctorDesc();
                                                                                                                  ^
Mercury/javas/jmercury/indexing.java:18: error: package jmercury.runtime does not exist 
  private static final jmercury.runtime.EnumFunctorDesc indexing__enum_functor_desc_t32_0_3 = new jmercury.runtime.EnumFunctorDesc();
                                                                                                                  ^
Mercury/javas/jmercury/indexing.java:19: error: package jmercury.runtime does not exist 
  private static final jmercury.runtime.EnumFunctorDesc indexing__enum_functor_desc_t32_0_4 = new jmercury.runtime.EnumFunctorDesc();
                                                                                                                  ^
Mercury/javas/jmercury/indexing.java:20: error: package jmercury.runtime does not exist 
  private static final jmercury.runtime.EnumFunctorDesc indexing__enum_functor_desc_t32_0_5 = new jmercury.runtime.EnumFunctorDesc();
                                                                                                                  ^
Mercury/javas/jmercury/indexing.java:21: error: package jmercury.runtime does not exist 
  private static final jmercury.runtime.EnumFunctorDesc indexing__enum_functor_desc_t32_0_6 = new jmercury.runtime.EnumFunctorDesc();
                                                                                                                  ^
Mercury/javas/jmercury/indexing.java:22: error: package jmercury.runtime does not exist 
  private static final jmercury.runtime.EnumFunctorDesc indexing__enum_functor_desc_t32_0_7 = new jmercury.runtime.EnumFunctorDesc();
                                                                                                                  ^
Mercury/javas/jmercury/indexing.java:23: error: package jmercury.runtime does not exist 
  private static final jmercury.runtime.EnumFunctorDesc indexing__enum_functor_desc_t32_0_8 = new jmercury.runtime.EnumFunctorDesc();
                                                                                                                  ^
Mercury/javas/jmercury/indexing.java:24: error: package jmercury.runtime does not exist 
  private static final jmercury.runtime.EnumFunctorDesc indexing__enum_functor_desc_t32_0_9 = new jmercury.runtime.EnumFunctorDesc();
                                                                                                                  ^
Mercury/javas/jmercury/indexing.java:25: error: package jmercury.runtime does not exist 
  private static final jmercury.runtime.EnumFunctorDesc indexing__enum_functor_desc_t32_0_10 = new jmercury.runtime.EnumFunctorDesc();
                                                                                                                   ^
Mercury/javas/jmercury/indexing.java:26: error: package jmercury.runtime does not exist 
  private static final jmercury.runtime.EnumFunctorDesc indexing__enum_functor_desc_t32_0_11 = new jmercury.runtime.EnumFunctorDesc();
                                                                                                                   ^
Mercury/javas/jmercury/indexing.java:27: error: package jmercury.runtime does not exist 
  private static final jmercury.runtime.EnumFunctorDesc indexing__enum_functor_desc_t32_0_12 = new jmercury.runtime.EnumFunctorDesc();
                                                                                                                   ^
Mercury/javas/jmercury/indexing.java:28: error: package jmercury.runtime does not exist 
  private static final jmercury.runtime.EnumFunctorDesc indexing__enum_functor_desc_t32_0_13 = new jmercury.runtime.EnumFunctorDesc();
                                                                                                                   ^
Mercury/javas/jmercury/indexing.java:29: error: package jmercury.runtime does not exist 
  private static final jmercury.runtime.EnumFunctorDesc indexing__enum_functor_desc_t32_0_14 = new jmercury.runtime.EnumFunctorDesc();
                                                                                                                   ^
Mercury/javas/jmercury/indexing.java:30: error: package jmercury.runtime does not exist 
  private static final jmercury.runtime.EnumFunctorDesc indexing__enum_functor_desc_t32_0_15 = new jmercury.runtime.EnumFunctorDesc();
                                                                                                                   ^
Mercury/javas/jmercury/indexing.java:31: error: package jmercury.runtime does not exist 
  private static final jmercury.runtime.EnumFunctorDesc indexing__enum_functor_desc_t32_0_16 = new jmercury.runtime.EnumFunctorDesc();
                                                                                                                   ^
Mercury/javas/jmercury/indexing.java:32: error: package jmercury.runtime does not exist 
  private static final jmercury.runtime.EnumFunctorDesc indexing__enum_functor_desc_t32_0_17 = new jmercury.runtime.EnumFunctorDesc();
                                                                                                                   ^
Mercury/javas/jmercury/indexing.java:33: error: package jmercury.runtime does not exist 
  private static final jmercury.runtime.EnumFunctorDesc indexing__enum_functor_desc_t32_0_18 = new jmercury.runtime.EnumFunctorDesc();
                                                                                                                   ^
Mercury/javas/jmercury/indexing.java:34: error: package jmercury.runtime does not exist 
  private static final jmercury.runtime.EnumFunctorDesc indexing__enum_functor_desc_t32_0_19 = new jmercury.runtime.EnumFunctorDesc();
                                                                                                                   ^
Mercury/javas/jmercury/indexing.java:35: error: package jmercury.runtime does not exist 
  private static final jmercury.runtime.EnumFunctorDesc indexing__enum_functor_desc_t32_0_20 = new jmercury.runtime.EnumFunctorDesc();
                                                                                                                   ^
Mercury/javas/jmercury/indexing.java:36: error: package jmercury.runtime does not exist 
  private static final jmercury.runtime.EnumFunctorDesc indexing__enum_functor_desc_t32_0_21 = new jmercury.runtime.EnumFunctorDesc();
                                                                                                                   ^
Mercury/javas/jmercury/indexing.java:37: error: package jmercury.runtime does not exist 
  private static final jmercury.runtime.EnumFunctorDesc indexing__enum_functor_desc_t32_0_22 = new jmercury.runtime.EnumFunctorDesc();
                                                                                                                   ^
Mercury/javas/jmercury/indexing.java:38: error: package jmercury.runtime does not exist 
  private static final jmercury.runtime.EnumFunctorDesc indexing__enum_functor_desc_t32_0_23 = new jmercury.runtime.EnumFunctorDesc();
                                                                                                                   ^
Mercury/javas/jmercury/indexing.java:39: error: package jmercury.runtime does not exist 
  private static final jmercury.runtime.EnumFunctorDesc indexing__enum_functor_desc_t32_0_24 = new jmercury.runtime.EnumFunctorDesc();
                                                                                                                   ^
Mercury/javas/jmercury/indexing.java:40: error: package jmercury.runtime does not exist 
  private static final jmercury.runtime.EnumFunctorDesc indexing__enum_functor_desc_t32_0_25 = new jmercury.runtime.EnumFunctorDesc();
                                                                                                                   ^
Mercury/javas/jmercury/indexing.java:41: error: package jmercury.runtime does not exist 
  private static final jmercury.runtime.EnumFunctorDesc indexing__enum_functor_desc_t32_0_26 = new jmercury.runtime.EnumFunctorDesc();
                                                                                                                   ^
Mercury/javas/jmercury/indexing.java:42: error: package jmercury.runtime does not exist 
  private static final jmercury.runtime.EnumFunctorDesc indexing__enum_functor_desc_t32_0_27 = new jmercury.runtime.EnumFunctorDesc();
                                                                                                                   ^
Mercury/javas/jmercury/indexing.java:43: error: package jmercury.runtime does not exist 
  private static final jmercury.runtime.EnumFunctorDesc indexing__enum_functor_desc_t32_0_28 = new jmercury.runtime.EnumFunctorDesc();
                                                                                                                   ^
Mercury/javas/jmercury/indexing.java:44: error: package jmercury.runtime does not exist 
  private static final jmercury.runtime.EnumFunctorDesc indexing__enum_functor_desc_t32_0_29 = new jmercury.runtime.EnumFunctorDesc();
                                                                                                                   ^
Mercury/javas/jmercury/indexing.java:45: error: package jmercury.runtime does not exist 
  private static final jmercury.runtime.EnumFunctorDesc indexing__enum_functor_desc_t32_0_30 = new jmercury.runtime.EnumFunctorDesc();
                                                                                                                   ^
Mercury/javas/jmercury/indexing.java:46: error: package jmercury.runtime does not exist 
  private static final jmercury.runtime.EnumFunctorDesc indexing__enum_functor_desc_t32_0_31 = new jmercury.runtime.EnumFunctorDesc();
                                                                                                                   ^
Mercury/javas/jmercury/indexing.java:47: error: package jmercury.runtime does not exist 
  private static final jmercury.runtime.EnumFunctorDesc[] indexing__enum_ordinal_ordered_t32_0 = new jmercury.runtime.EnumFunctorDesc[32];
                                                                                                                     ^
Mercury/javas/jmercury/indexing.java:48: error: package jmercury.runtime does not exist 
  private static final jmercury.runtime.EnumFunctorDesc[] indexing__enum_name_ordered_t32_0 = new jmercury.runtime.EnumFunctorDesc[32];
                                                                                                                  ^
Mercury/javas/jmercury/indexing.java:50: error: package jmercury.runtime does not exist 
  public static final jmercury.runtime.TypeCtorInfo_Struct indexing__type_ctor_info_t32_0 = new jmercury.runtime.TypeCtorInfo_Struct();
                                                                                                                ^
Mercury/javas/jmercury/indexing.java:51: error: package jmercury.runtime does not exist 
  private static final jmercury.runtime.EnumFunctorDesc indexing__enum_functor_desc_t5_0_0 = new jmercury.runtime.EnumFunctorDesc();
                                                                                                                 ^
Mercury/javas/jmercury/indexing.java:52: error: package jmercury.runtime does not exist 
  private static final jmercury.runtime.EnumFunctorDesc indexing__enum_functor_desc_t5_0_1 = new jmercury.runtime.EnumFunctorDesc();
                                                                                                                 ^
Mercury/javas/jmercury/indexing.java:53: error: package jmercury.runtime does not exist 
  private static final jmercury.runtime.EnumFunctorDesc indexing__enum_functor_desc_t5_0_2 = new jmercury.runtime.EnumFunctorDesc();
                                                                                                                 ^
Mercury/javas/jmercury/indexing.java:54: error: package jmercury.runtime does not exist 
  private static final jmercury.runtime.EnumFunctorDesc indexing__enum_functor_desc_t5_0_3 = new jmercury.runtime.EnumFunctorDesc();
                                                                                                                 ^
Mercury/javas/jmercury/indexing.java:55: error: package jmercury.runtime does not exist 
  private static final jmercury.runtime.EnumFunctorDesc indexing__enum_functor_desc_t5_0_4 = new jmercury.runtime.EnumFunctorDesc();
                                                                                                                 ^
Mercury/javas/jmercury/indexing.java:56: error: package jmercury.runtime does not exist 
  private static final jmercury.runtime.EnumFunctorDesc[] indexing__enum_ordinal_ordered_t5_0 = new jmercury.runtime.EnumFunctorDesc[5];
                                                                                                                    ^
Mercury/javas/jmercury/indexing.java:57: error: package jmercury.runtime does not exist 
  private static final jmercury.runtime.EnumFunctorDesc[] indexing__enum_name_ordered_t5_0 = new jmercury.runtime.EnumFunctorDesc[5];
                                                                                                                 ^
Mercury/javas/jmercury/indexing.java:59: error: package jmercury.runtime does not exist 
  public static final jmercury.runtime.TypeCtorInfo_Struct indexing__type_ctor_info_t5_0 = new jmercury.runtime.TypeCtorInfo_Struct();
                                                                                                               ^
Mercury/javas/jmercury/indexing.java:387: error: package jmercury.runtime does not exist 
      jmercury.runtime.TypeCtorRep.MR_TYPECTOR_REP_ENUM,
                      ^
Mercury/javas/jmercury/indexing.java:392: error: package jmercury.runtime does not exist 
      new jmercury.runtime.TypeFunctors(
                          ^
Mercury/javas/jmercury/indexing.java:395: error: package jmercury.runtime does not exist 
      new jmercury.runtime.TypeLayout(
                          ^
Mercury/javas/jmercury/indexing.java:457: error: package jmercury.runtime does not exist 
      jmercury.runtime.TypeCtorRep.MR_TYPECTOR_REP_ENUM,
                      ^
Mercury/javas/jmercury/indexing.java:462: error: package jmercury.runtime does not exist 
      new jmercury.runtime.TypeFunctors(
                          ^
Mercury/javas/jmercury/indexing.java:465: error: package jmercury.runtime does not exist 
      new jmercury.runtime.TypeLayout(
                          ^
Mercury/javas/jmercury/indexing.java:487: error: cannot find symbol 
    switch (HeadVar__1_1.MR_value) {
                        ^
  symbol:   variable MR_value
  location: variable HeadVar__1_1 of type T5_0
100 errors
** Error making `Mercury/classes/jmercury/indexing.class'.
gmake[3]: *** [/tmp/mmake.iNqjr5:1497: indexing.class] Error 1
gmake[3]: Target 'indexing.runtest' not remade because of errors.
gmake[3]: Leaving directory '/home/mercury/testing/run/build/mercury-srcdist-rotd-2025-03-28/tests/valid'