MERCURY_OPTIONS=
gmake[3]: Entering directory '/home/mercury/testing/run/build/mercury-srcdist-rotd-2025-03-28/tests/hard_coded'
{ echo MCFLAGS += '--grade java    --options-file /home/mercury/testing/run/build/mercury-srcdist-rotd-2025-03-28/stage2/Mercury.options --mercury-linkage static -j2 --flags ../TESTS_FLAGS --flags ../WS_FLAGS --use-subdirs  --no-warn-obsolete  '; echo MCFLAGS += ' '; echo CFLAGS += '    '; echo JAVACFLAGS += '-J"-Xmx1024m"   '; echo CSCFLAGS += '   '; echo C2INITARGS += '/home/mercury/testing/run/build/mercury-srcdist-rotd-2025-03-28/stage2/library/mer_std.init /home/mercury/testing/run/build/mercury-srcdist-rotd-2025-03-28/stage2/runtime/mer_rt.init    '; echo MLLIBS += '   '; echo MLOBJS += '  '; echo LDFLAGS += '  '; echo LD_LIBFLAGS += '  '; echo EXTRA_LIBRARIES += ''; echo EXTRA_LIB_DIRS += ''; echo LIBGRADES = 'hlc.gc  '; echo INSTALL_PREFIX = '/home/mercury/testing/run/install'; echo LINKAGE = 'shared'; echo MERCURY_LINKAGE = 'shared'; } | /home/mercury/testing/run/build/mercury-srcdist-rotd-2025-03-28/stage2/scripts/mmc --make --options-file - erroneous_liveness.depend
gmake[3]: Leaving directory '/home/mercury/testing/run/build/mercury-srcdist-rotd-2025-03-28/tests/hard_coded'
gmake[3]: Entering directory '/home/mercury/testing/run/build/mercury-srcdist-rotd-2025-03-28/tests/hard_coded'
{ echo MCFLAGS += '--grade java    --options-file /home/mercury/testing/run/build/mercury-srcdist-rotd-2025-03-28/stage2/Mercury.options --mercury-linkage static -j2 --flags ../TESTS_FLAGS --flags ../WS_FLAGS --use-subdirs  --no-warn-obsolete  '; echo MCFLAGS += ' '; echo CFLAGS += '    '; echo JAVACFLAGS += '-J"-Xmx1024m"   '; echo CSCFLAGS += '   '; echo C2INITARGS += '/home/mercury/testing/run/build/mercury-srcdist-rotd-2025-03-28/stage2/library/mer_std.init /home/mercury/testing/run/build/mercury-srcdist-rotd-2025-03-28/stage2/runtime/mer_rt.init    '; echo MLLIBS += '   '; echo MLOBJS += '  '; echo LDFLAGS += '  '; echo LD_LIBFLAGS += '  '; echo EXTRA_LIBRARIES += ''; echo EXTRA_LIB_DIRS += ''; echo LIBGRADES = 'hlc.gc  '; echo INSTALL_PREFIX = '/home/mercury/testing/run/install'; echo LINKAGE = 'shared'; echo MERCURY_LINKAGE = 'shared'; } | /home/mercury/testing/run/build/mercury-srcdist-rotd-2025-03-28/stage2/scripts/mmc --make --options-file - erroneous_liveness
Making Mercury/int3s/erroneous_liveness.int3
Making Mercury/ints/erroneous_liveness.int
Making Mercury/javas/jmercury/erroneous_liveness.java
Making Java class files
Mercury/javas/jmercury/erroneous_liveness.java:32: error: package jmercury.runtime does not exist 
  public static final jmercury.runtime.TypeCtorInfo_Struct erroneous_liveness__type_ctor_info_buffer_size_0 = new jmercury.runtime.TypeCtorInfo_Struct();
                                      ^
Mercury/javas/jmercury/erroneous_liveness.java:33: error: package jmercury.runtime does not exist 
  public static final jmercury.runtime.TypeCtorInfo_Struct erroneous_liveness__type_ctor_info_cardinality_0 = new jmercury.runtime.TypeCtorInfo_Struct();
                                      ^
Mercury/javas/jmercury/erroneous_liveness.java:34: error: package jmercury.runtime does not exist 
  private static final jmercury.runtime.EnumFunctorDesc erroneous_liveness__enum_functor_desc_column_0_0 = new jmercury.runtime.EnumFunctorDesc();
                                       ^
Mercury/javas/jmercury/erroneous_liveness.java:35: error: package jmercury.runtime does not exist 
  private static final jmercury.runtime.EnumFunctorDesc erroneous_liveness__enum_functor_desc_column_0_1 = new jmercury.runtime.EnumFunctorDesc();
                                       ^
Mercury/javas/jmercury/erroneous_liveness.java:36: error: package jmercury.runtime does not exist 
  private static final jmercury.runtime.EnumFunctorDesc erroneous_liveness__enum_functor_desc_column_0_2 = new jmercury.runtime.EnumFunctorDesc();
                                       ^
Mercury/javas/jmercury/erroneous_liveness.java:37: error: package jmercury.runtime does not exist 
  private static final jmercury.runtime.EnumFunctorDesc[] erroneous_liveness__enum_ordinal_ordered_column_0 = new jmercury.runtime.EnumFunctorDesc[3];
                                       ^
Mercury/javas/jmercury/erroneous_liveness.java:38: error: package jmercury.runtime does not exist 
  private static final jmercury.runtime.EnumFunctorDesc[] erroneous_liveness__enum_name_ordered_column_0 = new jmercury.runtime.EnumFunctorDesc[3];
                                       ^
Mercury/javas/jmercury/erroneous_liveness.java:40: error: package jmercury.runtime does not exist 
  public static final jmercury.runtime.TypeCtorInfo_Struct erroneous_liveness__type_ctor_info_column_0 = new jmercury.runtime.TypeCtorInfo_Struct();
                                      ^
Mercury/javas/jmercury/erroneous_liveness.java:41: error: package jmercury.runtime does not exist 
  public static final jmercury.runtime.TypeCtorInfo_Struct erroneous_liveness__type_ctor_info_cost_0 = new jmercury.runtime.TypeCtorInfo_Struct();
                                      ^
Mercury/javas/jmercury/erroneous_liveness.java:42: error: package jmercury.runtime does not exist 
  public static final jmercury.runtime.TypeCtorInfo_Struct erroneous_liveness__type_ctor_info_entry_0 = new jmercury.runtime.TypeCtorInfo_Struct();
                                      ^
Mercury/javas/jmercury/erroneous_liveness.java:43: error: package jmercury.runtime does not exist 
  private static final jmercury.runtime.TypeInfo_Struct set_ordlist__ti_set_ordlist_1builtin__type_ctor_info_string_0 = new jmercury.runtime.TypeInfo_Struct();
                                       ^
Mercury/javas/jmercury/erroneous_liveness.java:44: error: package jmercury.runtime does not exist 
  private static final jmercury.runtime.PseudoTypeInfo[] erroneous_liveness__field_types_field_0_0 = new jmercury.runtime.PseudoTypeInfo[3];
                                       ^
Mercury/javas/jmercury/erroneous_liveness.java:45: error: package jmercury.runtime does not exist 
  private static final jmercury.runtime.DuFunctorDesc erroneous_liveness__du_functor_desc_field_0_0 = new jmercury.runtime.DuFunctorDesc();
                                       ^
Mercury/javas/jmercury/erroneous_liveness.java:46: error: package jmercury.runtime does not exist 
  private static final jmercury.runtime.DuFunctorDesc[] erroneous_liveness__du_stag_ordered_field_0_0 = new jmercury.runtime.DuFunctorDesc[1];
                                       ^
Mercury/javas/jmercury/erroneous_liveness.java:47: error: package jmercury.runtime does not exist 
  private static final jmercury.runtime.DuPtagLayout[] erroneous_liveness__du_ptag_ordered_field_0 = new jmercury.runtime.DuPtagLayout[1];
                                       ^
Mercury/javas/jmercury/erroneous_liveness.java:48: error: package jmercury.runtime does not exist 
  private static final jmercury.runtime.DuFunctorDesc[] erroneous_liveness__du_name_ordered_field_0 = new jmercury.runtime.DuFunctorDesc[1];
                                       ^
Mercury/javas/jmercury/erroneous_liveness.java:50: error: package jmercury.runtime does not exist 
  public static final jmercury.runtime.TypeCtorInfo_Struct erroneous_liveness__type_ctor_info_field_0 = new jmercury.runtime.TypeCtorInfo_Struct();
                                      ^
Mercury/javas/jmercury/erroneous_liveness.java:51: error: package jmercury.runtime does not exist 
  private static final jmercury.runtime.EnumFunctorDesc erroneous_liveness__enum_functor_desc_indexing_0_0 = new jmercury.runtime.EnumFunctorDesc();
                                       ^
Mercury/javas/jmercury/erroneous_liveness.java:52: error: package jmercury.runtime does not exist 
  private static final jmercury.runtime.EnumFunctorDesc erroneous_liveness__enum_functor_desc_indexing_0_1 = new jmercury.runtime.EnumFunctorDesc();
                                       ^
Mercury/javas/jmercury/erroneous_liveness.java:53: error: package jmercury.runtime does not exist 
  private static final jmercury.runtime.EnumFunctorDesc[] erroneous_liveness__enum_ordinal_ordered_indexing_0 = new jmercury.runtime.EnumFunctorDesc[2];
                                       ^
Mercury/javas/jmercury/erroneous_liveness.java:54: error: package jmercury.runtime does not exist 
  private static final jmercury.runtime.EnumFunctorDesc[] erroneous_liveness__enum_name_ordered_indexing_0 = new jmercury.runtime.EnumFunctorDesc[2];
                                       ^
Mercury/javas/jmercury/erroneous_liveness.java:56: error: package jmercury.runtime does not exist 
  public static final jmercury.runtime.TypeCtorInfo_Struct erroneous_liveness__type_ctor_info_indexing_0 = new jmercury.runtime.TypeCtorInfo_Struct();
                                      ^
Mercury/javas/jmercury/erroneous_liveness.java:57: error: package jmercury.runtime does not exist 
  private static final jmercury.runtime.PseudoTypeInfo[] erroneous_liveness__field_types_operation_0_0 = new jmercury.runtime.PseudoTypeInfo[1];
                                       ^
Mercury/javas/jmercury/erroneous_liveness.java:58: error: package jmercury.runtime does not exist 
  private static final jmercury.runtime.DuFunctorDesc erroneous_liveness__du_functor_desc_operation_0_0 = new jmercury.runtime.DuFunctorDesc();
                                       ^
Mercury/javas/jmercury/erroneous_liveness.java:59: error: package jmercury.runtime does not exist 
  private static final jmercury.runtime.DuFunctorDesc erroneous_liveness__du_functor_desc_operation_0_1 = new jmercury.runtime.DuFunctorDesc();
                                       ^
Mercury/javas/jmercury/erroneous_liveness.java:60: error: package jmercury.runtime does not exist 
  private static final jmercury.runtime.PseudoTypeInfo[] erroneous_liveness__field_types_operation_0_2 = new jmercury.runtime.PseudoTypeInfo[1];
                                       ^
Mercury/javas/jmercury/erroneous_liveness.java:61: error: package jmercury.runtime does not exist 
  private static final jmercury.runtime.DuFunctorDesc erroneous_liveness__du_functor_desc_operation_0_2 = new jmercury.runtime.DuFunctorDesc();
                                       ^
Mercury/javas/jmercury/erroneous_liveness.java:62: error: package jmercury.runtime does not exist 
  private static final jmercury.runtime.PseudoTypeInfo[] erroneous_liveness__field_types_operation_0_3 = new jmercury.runtime.PseudoTypeInfo[2];
                                       ^
Mercury/javas/jmercury/erroneous_liveness.java:63: error: package jmercury.runtime does not exist 
  private static final jmercury.runtime.DuFunctorDesc erroneous_liveness__du_functor_desc_operation_0_3 = new jmercury.runtime.DuFunctorDesc();
                                       ^
Mercury/javas/jmercury/erroneous_liveness.java:64: error: package jmercury.runtime does not exist 
  private static final jmercury.runtime.DuFunctorDesc erroneous_liveness__du_functor_desc_operation_0_4 = new jmercury.runtime.DuFunctorDesc();
                                       ^
Mercury/javas/jmercury/erroneous_liveness.java:65: error: package jmercury.runtime does not exist 
  private static final jmercury.runtime.DuFunctorDesc[] erroneous_liveness__du_stag_ordered_operation_0_0 = new jmercury.runtime.DuFunctorDesc[5];
                                       ^
Mercury/javas/jmercury/erroneous_liveness.java:66: error: package jmercury.runtime does not exist 
  private static final jmercury.runtime.DuPtagLayout[] erroneous_liveness__du_ptag_ordered_operation_0 = new jmercury.runtime.DuPtagLayout[1];
                                       ^
Mercury/javas/jmercury/erroneous_liveness.java:67: error: package jmercury.runtime does not exist 
  private static final jmercury.runtime.DuFunctorDesc[] erroneous_liveness__du_name_ordered_operation_0 = new jmercury.runtime.DuFunctorDesc[5];
                                       ^
Mercury/javas/jmercury/erroneous_liveness.java:69: error: package jmercury.runtime does not exist 
  public static final jmercury.runtime.TypeCtorInfo_Struct erroneous_liveness__type_ctor_info_operation_0 = new jmercury.runtime.TypeCtorInfo_Struct();
                                      ^
Mercury/javas/jmercury/erroneous_liveness.java:70: error: package jmercury.runtime does not exist 
  private static final jmercury.runtime.TypeInfo_Struct set_ordlist__ti_set_ordlist_1erroneous_liveness__type_ctor_info_tuple_0 = new jmercury.runtime.TypeInfo_Struct();
                                       ^
Mercury/javas/jmercury/erroneous_liveness.java:71: error: package jmercury.runtime does not exist 
  private static final jmercury.runtime.PseudoTypeInfo[] erroneous_liveness__field_types_table_0_0 = new jmercury.runtime.PseudoTypeInfo[6];
                                       ^
Mercury/javas/jmercury/erroneous_liveness.java:72: error: package jmercury.runtime does not exist 
  private static final jmercury.runtime.DuFunctorDesc erroneous_liveness__du_functor_desc_table_0_0 = new jmercury.runtime.DuFunctorDesc();
                                       ^
Mercury/javas/jmercury/erroneous_liveness.java:73: error: package jmercury.runtime does not exist 
  private static final jmercury.runtime.DuFunctorDesc[] erroneous_liveness__du_stag_ordered_table_0_0 = new jmercury.runtime.DuFunctorDesc[1];
                                       ^
Mercury/javas/jmercury/erroneous_liveness.java:74: error: package jmercury.runtime does not exist 
  private static final jmercury.runtime.DuPtagLayout[] erroneous_liveness__du_ptag_ordered_table_0 = new jmercury.runtime.DuPtagLayout[1];
                                       ^
Mercury/javas/jmercury/erroneous_liveness.java:75: error: package jmercury.runtime does not exist 
  private static final jmercury.runtime.DuFunctorDesc[] erroneous_liveness__du_name_ordered_table_0 = new jmercury.runtime.DuFunctorDesc[1];
                                       ^
Mercury/javas/jmercury/erroneous_liveness.java:77: error: package jmercury.runtime does not exist 
  public static final jmercury.runtime.TypeCtorInfo_Struct erroneous_liveness__type_ctor_info_table_0 = new jmercury.runtime.TypeCtorInfo_Struct();
                                      ^
Mercury/javas/jmercury/erroneous_liveness.java:78: error: package jmercury.runtime does not exist 
  private static final jmercury.runtime.PseudoTypeInfo[] erroneous_liveness__field_types_tuple_0_0 = new jmercury.runtime.PseudoTypeInfo[3];
                                       ^
Mercury/javas/jmercury/erroneous_liveness.java:79: error: package jmercury.runtime does not exist 
  private static final jmercury.runtime.DuFunctorDesc erroneous_liveness__du_functor_desc_tuple_0_0 = new jmercury.runtime.DuFunctorDesc();
                                       ^
Mercury/javas/jmercury/erroneous_liveness.java:80: error: package jmercury.runtime does not exist 
  private static final jmercury.runtime.DuFunctorDesc[] erroneous_liveness__du_stag_ordered_tuple_0_0 = new jmercury.runtime.DuFunctorDesc[1];
                                       ^
Mercury/javas/jmercury/erroneous_liveness.java:81: error: package jmercury.runtime does not exist 
  private static final jmercury.runtime.DuPtagLayout[] erroneous_liveness__du_ptag_ordered_tuple_0 = new jmercury.runtime.DuPtagLayout[1];
                                       ^
Mercury/javas/jmercury/erroneous_liveness.java:82: error: package jmercury.runtime does not exist 
  private static final jmercury.runtime.DuFunctorDesc[] erroneous_liveness__du_name_ordered_tuple_0 = new jmercury.runtime.DuFunctorDesc[1];
                                       ^
Mercury/javas/jmercury/erroneous_liveness.java:84: error: package jmercury.runtime does not exist 
  public static final jmercury.runtime.TypeCtorInfo_Struct erroneous_liveness__type_ctor_info_tuple_0 = new jmercury.runtime.TypeCtorInfo_Struct();
                                      ^
Mercury/javas/jmercury/erroneous_liveness.java:593: error: package jmercury.runtime does not exist 
  private static final jmercury.runtime.TypeInfo_Struct[] MR_scalar_common_1 = new jmercury.runtime.TypeInfo_Struct[2];
                                       ^
Mercury/javas/jmercury/erroneous_liveness.java:594: error: package list.List_1 does not exist 
  private static final list.List_1.F_nil_0[] MR_scalar_common_2 = new list.List_1.F_nil_0[1];
                                  ^
Mercury/javas/jmercury/erroneous_liveness.java:645: error: package list does not exist 
    list.List_1 SCL_4,
        ^
Mercury/javas/jmercury/erroneous_liveness.java:646: error: package list does not exist 
    list.List_1 SL0_5)
        ^
Mercury/javas/jmercury/erroneous_liveness.java:643: error: package list does not exist 
  private static list.List_1
                     ^
Mercury/javas/jmercury/erroneous_liveness.java:2504: error: package jmercury.runtime does not exist 
    implements jmercury.runtime.MercuryType
                               ^
Mercury/javas/jmercury/erroneous_liveness.java:993: error: package list does not exist 
    list.List_1 HeadVar__2_2)
        ^
Mercury/javas/jmercury/erroneous_liveness.java:1035: error: package list does not exist 
    list.List_1 HeadVar__1_1,
        ^
Mercury/javas/jmercury/erroneous_liveness.java:1036: error: package list does not exist 
    list.List_1 SCL_2,
        ^
Mercury/javas/jmercury/erroneous_liveness.java:1037: error: package list does not exist 
    list.List_1 SL0_3)
        ^
Mercury/javas/jmercury/erroneous_liveness.java:1033: error: package list does not exist 
  private static list.List_1
                     ^
Mercury/javas/jmercury/erroneous_liveness.java:2395: error: package jmercury.runtime does not exist 
    implements jmercury.runtime.MercuryType
                               ^
Mercury/javas/jmercury/erroneous_liveness.java:1114: error: package builtin does not exist 
  private static builtin.Comparison_result_0
                        ^
Mercury/javas/jmercury/erroneous_liveness.java:1153: error: package builtin does not exist 
  private static builtin.Comparison_result_0
                        ^
Mercury/javas/jmercury/erroneous_liveness.java:2561: error: package jmercury.runtime does not exist 
    extends jmercury.runtime.MercuryEnum
                            ^
Mercury/javas/jmercury/erroneous_liveness.java:2562: error: package jmercury.runtime does not exist 
  implements jmercury.runtime.MercuryType
                             ^
Mercury/javas/jmercury/erroneous_liveness.java:1192: error: package builtin does not exist 
  private static builtin.Comparison_result_0
                        ^
Mercury/javas/jmercury/erroneous_liveness.java:1231: error: package builtin does not exist 
  private static builtin.Comparison_result_0
                        ^
Mercury/javas/jmercury/erroneous_liveness.java:1270: error: package builtin does not exist 
  private static builtin.Comparison_result_0
                        ^
Mercury/javas/jmercury/erroneous_liveness.java:1300: error: package builtin does not exist 
  private static builtin.Comparison_result_0
                        ^
Mercury/javas/jmercury/erroneous_liveness.java:2574: error: package jmercury.runtime does not exist 
    extends jmercury.runtime.MercuryEnum
                            ^
Mercury/javas/jmercury/erroneous_liveness.java:2575: error: package jmercury.runtime does not exist 
  implements jmercury.runtime.MercuryType
                             ^
Mercury/javas/jmercury/erroneous_liveness.java:1385: error: package builtin does not exist 
  private static builtin.Comparison_result_0
                        ^
Mercury/javas/jmercury/erroneous_liveness.java:2418: error: package jmercury.runtime does not exist 
    implements jmercury.runtime.MercuryType
                               ^
Mercury/javas/jmercury/erroneous_liveness.java:1424: error: package builtin does not exist 
  private static builtin.Comparison_result_0
                        ^
Mercury/javas/jmercury/erroneous_liveness.java:1600: error: package builtin does not exist 
  private static builtin.Comparison_result_0
                        ^
Mercury/javas/jmercury/erroneous_liveness.java:2536: error: package jmercury.runtime does not exist 
    implements jmercury.runtime.MercuryType
                               ^
Mercury/javas/jmercury/erroneous_liveness.java:1722: error: package builtin does not exist 
  private static builtin.Comparison_result_0
                        ^
Mercury/javas/jmercury/erroneous_liveness.java:2511: error: package set_ordlist does not exist 
    public set_ordlist.Set_ordlist_1<erroneous_liveness.Tuple_0> F6;
                      ^
Mercury/javas/jmercury/erroneous_liveness.java:2524: error: package set_ordlist does not exist 
      set_ordlist.Set_ordlist_1<erroneous_liveness.Tuple_0> F6)
                 ^
Mercury/javas/jmercury/erroneous_liveness.java:2399: error: package set_ordlist does not exist 
    public set_ordlist.Set_ordlist_1<java.lang.String> F3;
                      ^
Mercury/javas/jmercury/erroneous_liveness.java:2409: error: package set_ordlist does not exist 
      set_ordlist.Set_ordlist_1<java.lang.String> F3)
                 ^
Mercury/javas/jmercury/erroneous_liveness.java:2191: error: package jmercury.runtime does not exist 
    implements jmercury.runtime.MethodPtr2
                               ^
Mercury/javas/jmercury/erroneous_liveness.java:15: error: package jmercury.runtime does not exist 
    jmercury.runtime.JavaInternal.progname = "erroneous_liveness";
                    ^
Mercury/javas/jmercury/erroneous_liveness.java:16: error: package jmercury.runtime does not exist 
    jmercury.runtime.JavaInternal.args = args;
                    ^
Mercury/javas/jmercury/erroneous_liveness.java:17: error: package jmercury.runtime does not exist 
    jmercury.runtime.JavaInternal.exit_status = 0;
                    ^
Mercury/javas/jmercury/erroneous_liveness.java:18: error: cannot find symbol 
    library.ML_std_library_init();
    ^
  symbol:   variable library
  location: class erroneous_liveness
Mercury/javas/jmercury/erroneous_liveness.java:19: error: cannot find symbol 
    benchmarking.ML_initialise();
    ^
  symbol:   variable benchmarking
  location: class erroneous_liveness
Mercury/javas/jmercury/erroneous_liveness.java:25: error: package jmercury.runtime does not exist 
    jmercury.runtime.JavaInternal.runMain(run_main);
                    ^
Mercury/javas/jmercury/erroneous_liveness.java:26: error: cannot find symbol 
    io.flush_output_3_p_0(io.stdout_stream_0_f_0());
                          ^
  symbol:   variable io
  location: class erroneous_liveness
Mercury/javas/jmercury/erroneous_liveness.java:26: error: cannot find symbol 
    io.flush_output_3_p_0(io.stdout_stream_0_f_0());
    ^
  symbol:   variable io
  location: class erroneous_liveness
Mercury/javas/jmercury/erroneous_liveness.java:27: error: cannot find symbol 
    io.flush_output_3_p_0(io.stderr_stream_0_f_0());
                          ^
  symbol:   variable io
  location: class erroneous_liveness
Mercury/javas/jmercury/erroneous_liveness.java:27: error: cannot find symbol 
    io.flush_output_3_p_0(io.stderr_stream_0_f_0());
    ^
  symbol:   variable io
  location: class erroneous_liveness
Mercury/javas/jmercury/erroneous_liveness.java:28: error: package jmercury.runtime does not exist 
    java.lang.System.exit(jmercury.runtime.JavaInternal.exit_status);
                                          ^
Mercury/javas/jmercury/erroneous_liveness.java:32: error: package jmercury.runtime does not exist 
  public static final jmercury.runtime.TypeCtorInfo_Struct erroneous_liveness__type_ctor_info_buffer_size_0 = new jmercury.runtime.TypeCtorInfo_Struct();
                                                                                                                                  ^
Mercury/javas/jmercury/erroneous_liveness.java:33: error: package jmercury.runtime does not exist 
  public static final jmercury.runtime.TypeCtorInfo_Struct erroneous_liveness__type_ctor_info_cardinality_0 = new jmercury.runtime.TypeCtorInfo_Struct();
                                                                                                                                  ^
Mercury/javas/jmercury/erroneous_liveness.java:34: error: package jmercury.runtime does not exist 
  private static final jmercury.runtime.EnumFunctorDesc erroneous_liveness__enum_functor_desc_column_0_0 = new jmercury.runtime.EnumFunctorDesc();
                                                                                                                               ^
Mercury/javas/jmercury/erroneous_liveness.java:35: error: package jmercury.runtime does not exist 
  private static final jmercury.runtime.EnumFunctorDesc erroneous_liveness__enum_functor_desc_column_0_1 = new jmercury.runtime.EnumFunctorDesc();
                                                                                                                               ^
Mercury/javas/jmercury/erroneous_liveness.java:36: error: package jmercury.runtime does not exist 
  private static final jmercury.runtime.EnumFunctorDesc erroneous_liveness__enum_functor_desc_column_0_2 = new jmercury.runtime.EnumFunctorDesc();
                                                                                                                               ^
Mercury/javas/jmercury/erroneous_liveness.java:37: error: package jmercury.runtime does not exist 
  private static final jmercury.runtime.EnumFunctorDesc[] erroneous_liveness__enum_ordinal_ordered_column_0 = new jmercury.runtime.EnumFunctorDesc[3];
                                                                                                                                  ^
Mercury/javas/jmercury/erroneous_liveness.java:38: error: package jmercury.runtime does not exist 
  private static final jmercury.runtime.EnumFunctorDesc[] erroneous_liveness__enum_name_ordered_column_0 = new jmercury.runtime.EnumFunctorDesc[3];
                                                                                                                               ^
Mercury/javas/jmercury/erroneous_liveness.java:40: error: package jmercury.runtime does not exist 
  public static final jmercury.runtime.TypeCtorInfo_Struct erroneous_liveness__type_ctor_info_column_0 = new jmercury.runtime.TypeCtorInfo_Struct();
                                                                                                                             ^
Mercury/javas/jmercury/erroneous_liveness.java:41: error: package jmercury.runtime does not exist 
  public static final jmercury.runtime.TypeCtorInfo_Struct erroneous_liveness__type_ctor_info_cost_0 = new jmercury.runtime.TypeCtorInfo_Struct();
                                                                                                                           ^
100 errors
gmake[3]: *** [/tmp/mmake.qWHOny:2362: erroneous_liveness] Error 1
gmake[3]: Target 'erroneous_liveness.runtest' not remade because of errors.
gmake[3]: Leaving directory '/home/mercury/testing/run/build/mercury-srcdist-rotd-2025-03-28/tests/hard_coded'