MERCURY_OPTIONS=
gmake[3]: Entering directory '/home/mercury/testing/run/build/mercury-srcdist-rotd-2025-03-28/tests/hard_coded'
{ echo MCFLAGS += '--grade java    --options-file /home/mercury/testing/run/build/mercury-srcdist-rotd-2025-03-28/stage2/Mercury.options --mercury-linkage static -j2 --flags ../TESTS_FLAGS --flags ../WS_FLAGS --use-subdirs    '; echo MCFLAGS += ' '; echo CFLAGS += '    '; echo JAVACFLAGS += '-J"-Xmx1024m"   '; echo CSCFLAGS += '   '; echo C2INITARGS += '/home/mercury/testing/run/build/mercury-srcdist-rotd-2025-03-28/stage2/library/mer_std.init /home/mercury/testing/run/build/mercury-srcdist-rotd-2025-03-28/stage2/runtime/mer_rt.init    '; echo MLLIBS += '   '; echo MLOBJS += '  '; echo LDFLAGS += '  '; echo LD_LIBFLAGS += '  '; echo EXTRA_LIBRARIES += ''; echo EXTRA_LIB_DIRS += ''; echo LIBGRADES = 'hlc.gc  '; echo INSTALL_PREFIX = '/home/mercury/testing/run/install'; echo LINKAGE = 'shared'; echo MERCURY_LINKAGE = 'shared'; } | /home/mercury/testing/run/build/mercury-srcdist-rotd-2025-03-28/stage2/scripts/mmc --make --options-file - contains_char.depend
gmake[3]: Leaving directory '/home/mercury/testing/run/build/mercury-srcdist-rotd-2025-03-28/tests/hard_coded'
gmake[3]: Entering directory '/home/mercury/testing/run/build/mercury-srcdist-rotd-2025-03-28/tests/hard_coded'
{ echo MCFLAGS += '--grade java    --options-file /home/mercury/testing/run/build/mercury-srcdist-rotd-2025-03-28/stage2/Mercury.options --mercury-linkage static -j2 --flags ../TESTS_FLAGS --flags ../WS_FLAGS --use-subdirs    '; echo MCFLAGS += ' '; echo CFLAGS += '    '; echo JAVACFLAGS += '-J"-Xmx1024m"   '; echo CSCFLAGS += '   '; echo C2INITARGS += '/home/mercury/testing/run/build/mercury-srcdist-rotd-2025-03-28/stage2/library/mer_std.init /home/mercury/testing/run/build/mercury-srcdist-rotd-2025-03-28/stage2/runtime/mer_rt.init    '; echo MLLIBS += '   '; echo MLOBJS += '  '; echo LDFLAGS += '  '; echo LD_LIBFLAGS += '  '; echo EXTRA_LIBRARIES += ''; echo EXTRA_LIB_DIRS += ''; echo LIBGRADES = 'hlc.gc  '; echo INSTALL_PREFIX = '/home/mercury/testing/run/install'; echo LINKAGE = 'shared'; echo MERCURY_LINKAGE = 'shared'; } | /home/mercury/testing/run/build/mercury-srcdist-rotd-2025-03-28/stage2/scripts/mmc --make --options-file - contains_char
Making Mercury/int3s/contains_char.int3
Making Mercury/ints/contains_char.int
Making Mercury/javas/jmercury/contains_char.java
Making Java class files
Mercury/javas/jmercury/contains_char.java:15: error: package jmercury.runtime does not exist 
    jmercury.runtime.JavaInternal.progname = "contains_char";
                    ^
Mercury/javas/jmercury/contains_char.java:16: error: package jmercury.runtime does not exist 
    jmercury.runtime.JavaInternal.args = args;
                    ^
Mercury/javas/jmercury/contains_char.java:17: error: package jmercury.runtime does not exist 
    jmercury.runtime.JavaInternal.exit_status = 0;
                    ^
Mercury/javas/jmercury/contains_char.java:18: error: cannot find symbol 
    library.ML_std_library_init();
    ^
  symbol:   variable library
  location: class contains_char
Mercury/javas/jmercury/contains_char.java:19: error: cannot find symbol 
    benchmarking.ML_initialise();
    ^
  symbol:   variable benchmarking
  location: class contains_char
Mercury/javas/jmercury/contains_char.java:25: error: package jmercury.runtime does not exist 
    jmercury.runtime.JavaInternal.runMain(run_main);
                    ^
Mercury/javas/jmercury/contains_char.java:26: error: cannot find symbol 
    io.flush_output_3_p_0(io.stdout_stream_0_f_0());
                          ^
  symbol:   variable io
  location: class contains_char
Mercury/javas/jmercury/contains_char.java:26: error: cannot find symbol 
    io.flush_output_3_p_0(io.stdout_stream_0_f_0());
    ^
  symbol:   variable io
  location: class contains_char
Mercury/javas/jmercury/contains_char.java:27: error: cannot find symbol 
    io.flush_output_3_p_0(io.stderr_stream_0_f_0());
                          ^
  symbol:   variable io
  location: class contains_char
Mercury/javas/jmercury/contains_char.java:27: error: cannot find symbol 
    io.flush_output_3_p_0(io.stderr_stream_0_f_0());
    ^
  symbol:   variable io
  location: class contains_char
Mercury/javas/jmercury/contains_char.java:28: error: package jmercury.runtime does not exist 
    java.lang.System.exit(jmercury.runtime.JavaInternal.exit_status);
                                          ^
Mercury/javas/jmercury/contains_char.java:42: error: cannot find symbol 
      java.lang.Object [] result = mr_char.to_int_2_p_2(Var_7);
                                   ^
  symbol:   variable mr_char
  location: class contains_char
Mercury/javas/jmercury/contains_char.java:50: error: cannot find symbol 
        succeeded = string.contains_char_2_p_0(Var_8, Nul_4);
                    ^
  symbol:   variable string
  location: class contains_char
Mercury/javas/jmercury/contains_char.java:58: error: cannot find symbol 
        io.write_string_3_p_0(Var_9);
        ^
  symbol:   variable io
  location: class contains_char
Mercury/javas/jmercury/contains_char.java:66: error: cannot find symbol 
        io.write_string_3_p_0(Var_11);
        ^
  symbol:   variable io
  location: class contains_char
15 errors
gmake[3]: *** [/tmp/mmake.muddrN:2362: contains_char] Error 1
gmake[3]: Target 'contains_char.runtest' not remade because of errors.
gmake[3]: Leaving directory '/home/mercury/testing/run/build/mercury-srcdist-rotd-2025-03-28/tests/hard_coded'