asm_fast.gc.profdeep.stseg

Bootcheck terminated with exit status 1 (log)

/usr/bin/ld: warning: atomic_ops_sysdeps.o: missing .note.GNU-stack section implies executable stack
/usr/include/x86_64-linux-gnu/bits/string_fortified.h:138:10: warning: ‘__builtin___strncat_chk’ specified bound 1024 equals destination size [-Wstringop-overflow=]
/usr/include/x86_64-linux-gnu/bits/string_fortified.h:138:10: warning: ‘__builtin___strncat_chk’ specified bound 1024 equals destination size [-Wstringop-overflow=]
/usr/include/x86_64-linux-gnu/bits/string_fortified.h:138:10: warning: ‘__builtin___strncat_chk’ specified bound 1024 equals destination size [-Wstringop-overflow=]
/usr/include/x86_64-linux-gnu/bits/string_fortified.h:138:10: warning: ‘__builtin___strncat_chk’ specified bound 1024 equals destination size [-Wstringop-overflow=]
gmake[3]: warning: jobserver unavailable: using -j1.  Add '+' to parent make rule.
mercury_compile: error: the Mercury standard library cannot be found in grade
FAILED TEST mmc_make/bug489 in grade asm_fast.gc.profdeep.stseg
FAILED TEST mmc_make/factt in grade asm_fast.gc.profdeep.stseg
FAILED TEST mmc_make/hello in grade asm_fast.gc.profdeep.stseg
FAILED TEST mmc_make/include_file in grade asm_fast.gc.profdeep.stseg
FAILED TEST mmc_make/include_file2 in grade asm_fast.gc.profdeep.stseg
gmake[3]: warning: jobserver unavailable: using -j1.  Add '+' to parent make rule.
mercury_compile: error: the Mercury standard library cannot be found in grade
FAILED TEST mmc_make/rebuild in grade asm_fast.gc.profdeep.stseg
FAILED TEST mmc_make/complex_test in grade asm_fast.gc.profdeep.stseg
FAILED TEST mmc_make/linkage_test in grade asm_fast.gc.profdeep.stseg
ERROR EXIT: some tests failed

Duration: 1.02 hours