Bootcheck terminated with exit status 1 (log)
/usr/bin/ld: warning: atomic_ops_sysdeps.o: missing .note.GNU-stack section implies executable stack gmake[3]: warning: jobserver unavailable: using -j1. Add '+' to parent make rule. mercury_compile: error: the Mercury standard library cannot be found in grade FAILED TEST mmc_make/bug489 in grade asm_fast.gc.decldebug.stseg.tr FAILED TEST mmc_make/factt in grade asm_fast.gc.decldebug.stseg.tr FAILED TEST mmc_make/hello in grade asm_fast.gc.decldebug.stseg.tr FAILED TEST mmc_make/include_file in grade asm_fast.gc.decldebug.stseg.tr gmake[3]: warning: jobserver unavailable: using -j1. Add '+' to parent make rule. FAILED TEST mmc_make/include_file2 in grade asm_fast.gc.decldebug.stseg.tr mercury_compile: error: the Mercury standard library cannot be found in grade FAILED TEST mmc_make/rebuild in grade asm_fast.gc.decldebug.stseg.tr FAILED TEST mmc_make/complex_test in grade asm_fast.gc.decldebug.stseg.tr FAILED TEST mmc_make/linkage_test in grade asm_fast.gc.decldebug.stseg.tr ERROR EXIT: some tests failed
Duration: 1.27 hours