asm_fast.gc

Bootcheck terminated with exit status 1 (log)

/usr/bin/ld: warning: atomic_ops_sysdeps.o: missing .note.GNU-stack section implies executable stack
FAILED TEST debugger/user_event_shallow in grade asm_fast.gc
gmake[3]: warning: jobserver unavailable: using -j1.  Add '+' to parent make rule.
mercury_compile: error: the Mercury standard library cannot be found in grade
FAILED TEST mmc_make/bug489 in grade asm_fast.gc
FAILED TEST mmc_make/factt in grade asm_fast.gc
FAILED TEST mmc_make/hello in grade asm_fast.gc
FAILED TEST mmc_make/include_file in grade asm_fast.gc
gmake[3]: warning: jobserver unavailable: using -j1.  Add '+' to parent make rule.
FAILED TEST mmc_make/include_file2 in grade asm_fast.gc
mercury_compile: error: the Mercury standard library cannot be found in grade
FAILED TEST mmc_make/rebuild in grade asm_fast.gc
FAILED TEST mmc_make/complex_test in grade asm_fast.gc
FAILED TEST mmc_make/linkage_test in grade asm_fast.gc
ERROR EXIT: some tests failed

Duration: 1.32 hours