Bootcheck terminated with exit status 1 (log)
/usr/bin/ld: warning: atomic_ops_sysdeps.o: missing .note.GNU-stack section implies executable stack gmake[3]: warning: jobserver unavailable: using -j1. Add '+' to parent make rule. mercury_compile: error: the Mercury standard library cannot be found in grade FAILED TEST mmc_make/bug489 in grade hlc.gc FAILED TEST mmc_make/factt in grade hlc.gc FAILED TEST mmc_make/hello in grade hlc.gc FAILED TEST mmc_make/include_file in grade hlc.gc gmake[3]: warning: jobserver unavailable: using -j1. Add '+' to parent make rule. FAILED TEST mmc_make/include_file2 in grade hlc.gc mercury_compile: error: the Mercury standard library cannot be found in grade FAILED TEST mmc_make/rebuild in grade hlc.gc FAILED TEST mmc_make/complex_test in grade hlc.gc FAILED TEST mmc_make/linkage_test in grade hlc.gc ERROR EXIT: unexpected change in tests/debugger/mdb_command_test.inp ERROR EXIT: some tests failed
Duration: 1.18 hours