Bootcheck terminated with exit status 1 (log)
/usr/bin/ld: warning: atomic_ops_sysdeps.o: missing .note.GNU-stack section implies executable stack FAILED TEST debugger/tailrec1 in grade none.gc FAILED TEST invalid/foreign_decl_line_number-nodepend in grade none.gc gmake[3]: warning: jobserver unavailable: using -j1. Add '+' to parent make rule. mercury_compile: error: the Mercury standard library cannot be found in grade FAILED TEST mmc_make/bug489 in grade none.gc FAILED TEST mmc_make/factt in grade none.gc FAILED TEST mmc_make/hello in grade none.gc FAILED TEST mmc_make/include_file in grade none.gc gmake[3]: warning: jobserver unavailable: using -j1. Add '+' to parent make rule. FAILED TEST mmc_make/include_file2 in grade none.gc mercury_compile: error: the Mercury standard library cannot be found in grade FAILED TEST mmc_make/rebuild in grade none.gc FAILED TEST mmc_make/complex_test in grade none.gc FAILED TEST mmc_make/linkage_test in grade none.gc ERROR EXIT: some tests failed
Duration: 0.77 hours