hlc.par.gc

Bootcheck terminated with exit status 1 (log)

/usr/lib/gcc-cross/i686-linux-gnu/13/../../../../i686-linux-gnu/bin/ld: warning: atomic_ops_sysdeps.o: missing .note.GNU-stack section implies executable stack
FAILED TEST feedback/autopar_mandelbrot-nodepend in grade hlc.par.gc
FAILED TEST feedback/autopar_mmc-nodepend in grade hlc.par.gc
gmake[3]: warning: jobserver unavailable: using -j1.  Add '+' to parent make rule.
mercury_compile: error: the Mercury standard library cannot be found in grade
FAILED TEST mmc_make/bug489 in grade hlc.par.gc
FAILED TEST mmc_make/factt in grade hlc.par.gc
FAILED TEST mmc_make/hello in grade hlc.par.gc
FAILED TEST mmc_make/include_file in grade hlc.par.gc
FAILED TEST mmc_make/include_file2 in grade hlc.par.gc
mercury_compile: error: the Mercury standard library cannot be found in grade
FAILED TEST mmc_make/rebuild in grade hlc.par.gc
FAILED TEST mmc_make/complex_test in grade hlc.par.gc
FAILED TEST mmc_make/linkage_test in grade hlc.par.gc
FAILED TEST warnings/table_with_inline in grade hlc.par.gc
ERROR EXIT: unexpected change in tests/debugger/mdb_command_test.inp
ERROR EXIT: some tests failed
ERROR EXIT: some namespace isn't clean

Duration: 0.50 hours