hlc.par.gc

Bootcheck terminated with exit status 1 (log)

building of stage 3 browser initially not successful
building of stage 3 compiler initially not successful
FAILED TEST feedback/autopar_mandelbrot-nodepend in grade hlc.par.gc
FAILED TEST feedback/autopar_mmc-nodepend in grade hlc.par.gc
FAILED TEST hard_coded/existential_bound_tvar in grade hlc.par.gc
FAILED TEST hard_coded/nonascii in grade hlc.par.gc
FAILED TEST hard_coded/parse_number_from_string in grade hlc.par.gc
ERROR OUTPUT
FAILED TEST term/ack in grade hlc.par.gc
ERROR EXIT: some tests failed
ERROR EXIT: some namespace isn't clean

Duration: 0.86 hours