hlc.par.gc

Bootcheck terminated with exit status 1 (log)

FAILED TEST accumulator/nonrec in grade hlc.par.gc
ERROR OUTPUT
FAILED TEST feedback/autopar_mandelbrot-nodepend in grade hlc.par.gc
FAILED TEST feedback/autopar_mmc-nodepend in grade hlc.par.gc
FAILED TEST hard_coded/bad_direct_reuse in grade hlc.par.gc
ERROR OUTPUT
FAILED TEST hard_coded/promise_eqv_solns_typeclasses in grade hlc.par.gc
FAILED TEST hard_coded/read_binary_int16 in grade hlc.par.gc
FAILED TEST valid/complete_uint8_switch in grade hlc.par.gc
ERROR OUTPUT
FAILED TEST valid/mc_graph in grade hlc.par.gc
ERROR EXIT: some tests failed
ERROR EXIT: some namespace isn't clean

Duration: 0.93 hours