asm_fast.gc.decldebug.stseg

Bootcheck terminated with exit status 1 (log)

FAILED TEST declarative_debugger/throw in grade asm_fast.gc.decldebug.stseg
FAILED TEST valid/inst_perf_bug_1 in grade asm_fast.gc.decldebug.stseg
ERROR OUTPUT
FAILED TEST valid/inst_perf_bug_2 in grade asm_fast.gc.decldebug.stseg
ERROR OUTPUT
ERROR EXIT: some tests failed

Duration: 3.06 hours