asm_fast.gc.debug.stseg.trseg

Bootcheck terminated with exit status 1 (log)

FAILED TEST declarative_debugger/throw in grade asm_fast.gc.debug.stseg.trseg
FAILED TEST valid/inst_perf_bug_1 in grade asm_fast.gc.debug.stseg.trseg
ERROR OUTPUT
FAILED TEST valid/inst_perf_bug_2 in grade asm_fast.gc.debug.stseg.trseg
ERROR OUTPUT
ERROR EXIT: some tests failed

Duration: 2.94 hours