hlc.gc.memprof

Bootcheck terminated with exit status 1 (log)

FAILED TEST tabling/fib_stats in grade hlc.gc.memprof
FAILED TEST valid/table_aux_preds_erlang in grade hlc.gc.memprof
FAILED TEST valid/table_wrong_func_arity in grade hlc.gc.memprof
ERROR EXIT: some tests failed

Duration: 1.78 hours