hlc.par.gc

Bootcheck terminated with exit status 1 (log)

FAILED TEST feedback/autopar_mandelbrot-nodepend in grade hlc.par.gc
FAILED TEST feedback/autopar_mmc-nodepend in grade hlc.par.gc
FAILED TEST hard_coded/foreign_import_module in grade hlc.par.gc
FAILED TEST submodules/ts in grade hlc.par.gc
ERROR EXIT: some tests failed
ERROR EXIT: some namespace isn't clean

Duration: 3.05 hours