asm_fast.gc.decldebug.stseg

Bootcheck terminated with exit status 1 (log)

FAILED TEST declarative_debugger/solns in grade asm_fast.gc.decldebug.stseg
FAILED TEST declarative_debugger/track_through_catch in grade asm_fast.gc.decldebug.stseg
FAILED TEST valid/bug486 in grade asm_fast.gc.decldebug.stseg
FAILED TEST valid_seq/exported_foreign_type in grade asm_fast.gc.decldebug.stseg
FAILED TEST valid_seq/test_xmlreader in grade asm_fast.gc.decldebug.stseg
ERROR EXIT: some tests failed

Duration: 2.66 hours