asm_fast.gc.debug.stseg.trseg

Bootcheck terminated with exit status 1 (log)

FAILED TEST debugger/class_decl in grade asm_fast.gc.debug.stseg.trseg
FAILED TEST valid/bug486 in grade asm_fast.gc.debug.stseg.trseg
FAILED TEST valid_seq/exported_foreign_type in grade asm_fast.gc.debug.stseg.trseg
FAILED TEST valid_seq/test_xmlreader in grade asm_fast.gc.debug.stseg.trseg
ERROR EXIT: some tests failed

Duration: 2.54 hours