asm_fast.gc

Bootcheck terminated with exit status 1 (log)

FAILED TEST valid/bug486 in grade asm_fast.gc
FAILED TEST valid_seq/exported_foreign_type in grade asm_fast.gc
FAILED TEST valid_seq/test_xmlreader in grade asm_fast.gc
ERROR EXIT: some tests failed

Duration: 1.10 hours