none.gc

Bootcheck terminated with exit status 1 (log)

FAILED TEST valid/bug486 in grade none.gc
FAILED TEST valid_seq/exported_foreign_type in grade none.gc
FAILED TEST valid_seq/test_xmlreader in grade none.gc
ERROR EXIT: some tests failed

Duration: 1.47 hours