hlc.par.gc

Bootcheck terminated with exit status 1 (log)

FAILED TEST feedback/autopar_mandelbrot-nodepend in grade hlc.par.gc
FAILED TEST feedback/autopar_mmc-nodepend in grade hlc.par.gc
FAILED TEST submodules/ts in grade hlc.par.gc
ERROR EXIT: some tests failed
ERROR EXIT: some namespace isn't clean

Duration: 3.03 hours