asm_fast.par.gc

Bootcheck terminated with exit status 1 (log)

FAILED TEST debugger/fib in grade asm_fast.par.gc
FAILED TEST debugger/io_tab_goto in grade asm_fast.par.gc
FAILED TEST debugger/loopcheck in grade asm_fast.par.gc
FAILED TEST debugger/poly_io_retry in grade asm_fast.par.gc
FAILED TEST debugger/poly_io_retry2 in grade asm_fast.par.gc
FAILED TEST debugger/print_io_actions in grade asm_fast.par.gc
FAILED TEST debugger/print_table in grade asm_fast.par.gc
FAILED TEST debugger/retry in grade asm_fast.par.gc
FAILED TEST debugger/tabled_read in grade asm_fast.par.gc
FAILED TEST debugger/tabled_read_decl in grade asm_fast.par.gc
FAILED TEST debugger/tabled_read_unitize in grade asm_fast.par.gc
FAILED TEST debugger/tabled_typeclass in grade asm_fast.par.gc
FAILED TEST debugger/tailrec1 in grade asm_fast.par.gc
FAILED TEST declarative_debugger/io_tab_impure in grade asm_fast.par.gc
FAILED TEST declarative_debugger/tabled_read_decl in grade asm_fast.par.gc
FAILED TEST declarative_debugger/tabled_read_decl_goto in grade asm_fast.par.gc
FAILED TEST invalid/bad_item_in_interface-nodepend in grade asm_fast.par.gc
FAILED TEST invalid_onlydepend/bad_module_name-nodepend in grade asm_fast.par.gc
FAILED TEST par_conj/consume_in_some_branches in grade asm_fast.par.gc
FAILED TEST par_conj/consume_in_some_branches_and_after in grade asm_fast.par.gc
FAILED TEST par_conj/consume_wait in grade asm_fast.par.gc
FAILED TEST par_conj/dep_par_21 in grade asm_fast.par.gc
FAILED TEST par_conj/dep_par_24 in grade asm_fast.par.gc
FAILED TEST par_conj/dep_par_24b in grade asm_fast.par.gc
FAILED TEST par_conj/dep_par_7 in grade asm_fast.par.gc
FAILED TEST par_conj/pathological_right_recursion in grade asm_fast.par.gc
ERROR EXIT: some tests failed

Duration: 1.10 hours