asm_fast.gc.decldebug.stseg

Bootcheck terminated with exit status 1 (log)

FAILED TEST declarative_debugger/catch in grade asm_fast.gc.decldebug.stseg
FAILED TEST declarative_debugger/func_call in grade asm_fast.gc.decldebug.stseg
FAILED TEST declarative_debugger/gcf in grade asm_fast.gc.decldebug.stseg
FAILED TEST declarative_debugger/ho5 in grade asm_fast.gc.decldebug.stseg
FAILED TEST declarative_debugger/neg_conj in grade asm_fast.gc.decldebug.stseg
FAILED TEST declarative_debugger/solns in grade asm_fast.gc.decldebug.stseg
FAILED TEST declarative_debugger/throw in grade asm_fast.gc.decldebug.stseg
FAILED TEST declarative_debugger/track_through_catch in grade asm_fast.gc.decldebug.stseg
FAILED TEST invalid_onlydepend/bad_module_name-nodepend in grade asm_fast.gc.decldebug.stseg
ERROR EXIT: some tests failed

Duration: 2.66 hours