asm_fast.gc.debug.stseg.trseg

Bootcheck terminated with exit status 1 (log)

FAILED TEST debugger/class_decl in grade asm_fast.gc.debug.stseg.trseg
FAILED TEST declarative_debugger/catch in grade asm_fast.gc.debug.stseg.trseg
FAILED TEST declarative_debugger/find_origin in grade asm_fast.gc.debug.stseg.trseg
FAILED TEST declarative_debugger/func_call in grade asm_fast.gc.debug.stseg.trseg
FAILED TEST declarative_debugger/gcf in grade asm_fast.gc.debug.stseg.trseg
FAILED TEST declarative_debugger/ho5 in grade asm_fast.gc.debug.stseg.trseg
FAILED TEST declarative_debugger/neg_conj in grade asm_fast.gc.debug.stseg.trseg
FAILED TEST declarative_debugger/solns in grade asm_fast.gc.debug.stseg.trseg
FAILED TEST declarative_debugger/throw in grade asm_fast.gc.debug.stseg.trseg
FAILED TEST invalid_onlydepend/bad_module_name-nodepend in grade asm_fast.gc.debug.stseg.trseg
ERROR EXIT: some tests failed

Duration: 2.55 hours