asm_fast.gc

Bootcheck terminated with exit status 1 (log)

bitmap.m:743:37: warning: array subscript -1 is below array bounds of ‘MR_uint_least8_t[]’ {aka ‘unsigned char[]’} [-Warray-bounds]
bitmap.m:778:17: warning: array subscript -1 is below array bounds of ‘MR_uint_least8_t[]’ {aka ‘unsigned char[]’} [-Warray-bounds]
bitmap.m:743:37: warning: array subscript -1 is below array bounds of ‘MR_uint_least8_t[]’ {aka ‘unsigned char[]’} [-Warray-bounds]
bitmap.m:778:17: warning: array subscript -1 is below array bounds of ‘MR_uint_least8_t[]’ {aka ‘unsigned char[]’} [-Warray-bounds]
bitmap.m:743:37: warning: array subscript -1 is below array bounds of ‘MR_uint_least8_t[]’ {aka ‘unsigned char[]’} [-Warray-bounds]
bitmap.m:778:17: warning: array subscript -1 is below array bounds of ‘MR_uint_least8_t[]’ {aka ‘unsigned char[]’} [-Warray-bounds]
bitmap.m:743:37: warning: array subscript -1 is below array bounds of ‘MR_uint_least8_t[]’ {aka ‘unsigned char[]’} [-Warray-bounds]
bitmap.m:743:37: warning: array subscript -1 is below array bounds of ‘MR_uint_least8_t[]’ {aka ‘unsigned char[]’} [-Warray-bounds]
bitmap.m:778:17: warning: array subscript -1 is below array bounds of ‘MR_uint_least8_t[]’ {aka ‘unsigned char[]’} [-Warray-bounds]
bitmap.m:743:37: warning: array subscript -1 is below array bounds of ‘MR_uint_least8_t[]’ {aka ‘unsigned char[]’} [-Warray-bounds]
bitmap.m:743:37: warning: array subscript -1 is below array bounds of ‘MR_uint_least8_t[]’ {aka ‘unsigned char[]’} [-Warray-bounds]
bitmap.m:743:37: warning: array subscript -1 is below array bounds of ‘MR_uint_least8_t[]’ {aka ‘unsigned char[]’} [-Warray-bounds]
bitmap.m:743:37: warning: array subscript -1 is below array bounds of ‘MR_uint_least8_t[]’ {aka ‘unsigned char[]’} [-Warray-bounds]
bitmap.m:778:17: warning: array subscript -1 is below array bounds of ‘MR_uint_least8_t[]’ {aka ‘unsigned char[]’} [-Warray-bounds]
bitmap.m:743:37: warning: array subscript -1 is below array bounds of ‘MR_uint_least8_t[]’ {aka ‘unsigned char[]’} [-Warray-bounds]
bitmap.m:778:17: warning: array subscript -1 is below array bounds of ‘MR_uint_least8_t[]’ {aka ‘unsigned char[]’} [-Warray-bounds]
bitmap.m:743:37: warning: array subscript -1 is below array bounds of ‘MR_uint_least8_t[]’ {aka ‘unsigned char[]’} [-Warray-bounds]
bitmap.m:778:17: warning: array subscript -1 is below array bounds of ‘MR_uint_least8_t[]’ {aka ‘unsigned char[]’} [-Warray-bounds]
bitmap.m:743:37: warning: array subscript -1 is below array bounds of ‘MR_uint_least8_t[]’ {aka ‘unsigned char[]’} [-Warray-bounds]
bitmap.m:743:37: warning: array subscript -1 is below array bounds of ‘MR_uint_least8_t[]’ {aka ‘unsigned char[]’} [-Warray-bounds]
bitmap.m:778:17: warning: array subscript -1 is below array bounds of ‘MR_uint_least8_t[]’ {aka ‘unsigned char[]’} [-Warray-bounds]
bitmap.m:743:37: warning: array subscript -1 is below array bounds of ‘MR_uint_least8_t[]’ {aka ‘unsigned char[]’} [-Warray-bounds]
bitmap.m:743:37: warning: array subscript -1 is below array bounds of ‘MR_uint_least8_t[]’ {aka ‘unsigned char[]’} [-Warray-bounds]
bitmap.m:743:37: warning: array subscript -1 is below array bounds of ‘MR_uint_least8_t[]’ {aka ‘unsigned char[]’} [-Warray-bounds]
FAILED TEST debugger/user_event_shallow in grade asm_fast.gc
FAILED TEST declarative_debugger/throw in grade asm_fast.gc
FAILED TEST invalid_onlydepend/bad_module_name-nodepend in grade asm_fast.gc
FAILED TEST submodules/ts in grade asm_fast.gc
ERROR EXIT: some tests failed

Duration: 1.96 hours