reg.gc

Bootcheck terminated with exit status 1 (log)

FAILED TEST feedback/autopar_mandelbrot-nodepend in grade reg.gc
FAILED TEST feedback/autopar_mmc-nodepend in grade reg.gc
FAILED TEST string_format/string_format_int64_d in grade reg.gc
FAILED TEST string_format/string_format_int64_o in grade reg.gc
FAILED TEST string_format/string_format_int64_u in grade reg.gc
FAILED TEST string_format/string_format_int64_x in grade reg.gc
FAILED TEST string_format/string_format_uint64_o in grade reg.gc
FAILED TEST string_format/string_format_uint64_u in grade reg.gc
FAILED TEST string_format/string_format_uint64_x in grade reg.gc
ERROR EXIT: some tests failed

Duration: 1.23 hours