hlc.gc.memprof

Bootcheck terminated with exit status 1 (log)

FAILED TEST feedback/autopar_mandelbrot-nodepend in grade hlc.gc.memprof
FAILED TEST feedback/autopar_mmc-nodepend in grade hlc.gc.memprof
FAILED TEST string_format/string_format_int64_d in grade hlc.gc.memprof
FAILED TEST string_format/string_format_int64_o in grade hlc.gc.memprof
FAILED TEST string_format/string_format_int64_u in grade hlc.gc.memprof
FAILED TEST string_format/string_format_int64_x in grade hlc.gc.memprof
FAILED TEST string_format/string_format_uint64_o in grade hlc.gc.memprof
FAILED TEST string_format/string_format_uint64_u in grade hlc.gc.memprof
FAILED TEST string_format/string_format_uint64_x in grade hlc.gc.memprof
ERROR EXIT: some tests failed

Duration: 1.47 hours