reg.gc

Bootcheck terminated with exit status 1 (log)

FAILED TEST feedback/autopar_mandelbrot-nodepend in grade reg.gc
FAILED TEST feedback/autopar_mmc-nodepend in grade reg.gc
FAILED TEST string_format/string_format_d in grade reg.gc
FAILED TEST string_format/string_format_u in grade reg.gc
ERROR EXIT: some tests failed

Duration: 2.38 hours