asm_fast.gc.profdeep.stseg

Bootcheck terminated with exit status 1 (log)

FAILED TEST invalid/require_tailrec_1-nodepend in grade asm_fast.gc.profdeep.stseg
 require_tailrec_1.m:055:   warning: mutually recursive call to function
+require_tailrec_1.m:064:   warning: mutually recursive call to function
 require_tailrec_1.m:075:   warning: self-recursive call is not tail recursive.
FAILED TEST invalid/require_tailrec_2-nodepend in grade asm_fast.gc.profdeep.stseg
 require_tailrec_2.m:054:   warning: mutually recursive call to function
+require_tailrec_2.m:063:   warning: mutually recursive call to function
 require_tailrec_2.m:074:   warning: self-recursive call is not tail recursive.
 require_tailrec_2.m:126:   warning: the code defining this function contains no
+require_tailrec_2.m:137:   warning: self-recursive call is not tail recursive.
+require_tailrec_2.m:139:   warning: self-recursive call is not tail recursive.
FAILED TEST invalid/require_tailrec_3-nodepend in grade asm_fast.gc.profdeep.stseg
 require_tailrec_3.m:028:   warning: mutually recursive call to function
+require_tailrec_3.m:034:   warning: mutually recursive call to function
 require_tailrec_3.m:043:   error: mutually recursive call to function `odd2'/1
+require_tailrec_3.m:049:   warning: mutually recursive call to function
 require_tailrec_3.m:058:   warning: mutually recursive call to function
+require_tailrec_3.m:064:   warning: mutually recursive call to function
ERROR EXIT: some tests failed