hlc.par.gc

Bootcheck terminated with exit status 1 (log)

FAILED TEST feedback/autopar_mandelbrot-nodepend in grade hlc.par.gc
FAILED TEST feedback/autopar_mmc-nodepend in grade hlc.par.gc
FAILED TEST invalid/abstract_eqv in grade hlc.par.gc
abstract_eqv.m:019:   type error: argument has type `abstract_eqv2.bar',
FAILED TEST invalid/bug214-nodepend in grade hlc.par.gc
 bug214.m:043:   type error: unsatisfied typeclass constraint:
FAILED TEST invalid/int_impl_imports in grade hlc.par.gc
int_impl_imports.m:014:   error: undefined type `bar'/0.
FAILED TEST invalid/unsatisfiable_constraint-nodepend in grade hlc.par.gc
 unsatisfiable_constraint.m:039:   type error: unsatisfied typeclass constraints:
FAILED TEST submodules/ts in grade hlc.par.gc
FAILED TEST tabling/fast_loose in grade hlc.par.gc
FAILED TEST warnings/bug412 in grade hlc.par.gc
bug412.m:014:   warning: module `bitmap' has a `:- import_module' declaration,
bug412.m:015:   warning: module `bit_buffer' has a `:- import_module'
bug412.m:016:   warning: module `bool' has a `:- import_module' declaration,
bug412.m:018:   warning: module `char' has a `:- import_module' declaration,
bug412.m:019:   warning: module `diet' has a `:- import_module' declaration,
bug412.m:020:   warning: module `digraph' has a `:- import_module' declaration,
bug412.m:021:   warning: module `enum' has a `:- import_module' declaration,
bug412.m:023:   warning: module `ops' has a `:- import_module' declaration, but
bug412.m:024:   warning: module `pprint' has a `:- import_module' declaration,
bug412.m:025:   warning: module `rtree' has a `:- import_module' declaration,
bug412.m:026:   warning: module `store' has a `:- import_module' declaration,
bug412.m:027:   warning: module `stream' has a `:- import_module' declaration,
bug412.m:028:   warning: module `string' has a `:- import_module' declaration,
bug412.m:029:   warning: module `string.builder' has a `:- import_module'
bug412.m:031:   warning: module `term' has a `:- import_module' declaration,
bug412.m:032:   warning: module `univ' has a `:- import_module' declaration,
 bug412.m:021:   warning: module `enum' has a `:- import_module' declaration,
-bug412.m:022:   warning: module `io' has a `:- import_module' declaration, but
 bug412.m:023:   warning: module `ops' has a `:- import_module' declaration, but
FAILED TEST warnings/warn_stubs in grade hlc.par.gc
ERROR EXIT: some tests failed