asm_fast.par.gc

Bootcheck terminated with exit status 1 (log)

FAILED TEST hard_coded/map_select_test in grade asm_fast.par.gc
FAILED TEST hard_coded/test_generic_ref in grade asm_fast.par.gc
FAILED TEST par_conj/consume_in_some_branches_and_after in grade asm_fast.par.gc
FAILED TEST par_conj/consume_in_some_branches in grade asm_fast.par.gc
FAILED TEST par_conj/consume_wait in grade asm_fast.par.gc
FAILED TEST par_conj/dep_par_21 in grade asm_fast.par.gc
FAILED TEST par_conj/dep_par_24 in grade asm_fast.par.gc
FAILED TEST par_conj/dep_par_24b in grade asm_fast.par.gc
FAILED TEST par_conj/dep_par_7 in grade asm_fast.par.gc
FAILED TEST par_conj/pathological_right_recursion in grade asm_fast.par.gc
ERROR EXIT: some tests failed