none.gc

Bootcheck terminated with exit status 1 (log)

FAILED TEST hard_coded/parse in grade none.gc
mdb.dl.c:(.text+0x4f7): warning: Using 'dlopen' in statically linked applications requires at runtime the shared libraries from the glibc version used for linking
clang: error: linker command failed with exit code 1 (use -v to see invocation)
FAILED TEST hard_coded/test_generic_ref in grade none.gc
ERROR EXIT: some tests failed